{"text_format":"1","workbook":"xlsx","n_sheets":45,"sheets":["EKIPE I IGRAČI","UPUTE","SUDAC_EKIPE","ZAPISNIK MEČA","SUDAC_ZAPISNIK","ZAPISNIK_1_1","ZAPISNIK_1_2","ZAPISNIK_1_3","ZAPISNIK_2_1","ZAPISNIK_2_2","ZAPISNIK_2_3","ZAPISNIK_2_4","ZAPISNIK_3_1","ZAPISNIK_3_2","ZAPISNIK_3_3","ZAPISNIK_3_4","ZAPISNIK_4_1","ZAPISNIK_4_2","ZAPISNIK_4_3","ZAPISNIK_4_4","ZAPISNIK_4_5","ZAPISNIK_4_6","ZAPISNIK_5_1","ZAPISNIK_5_2","ZAPISNIK_5_3","ZAPISNIK_5_4","ZAPISNIK MEČA_PRINT","KOLA","POREDAK","DASHBOARD","SKOROVI IGRAČA POJEDINAČNO","SKOROVI PAROVA","VRIJEME","KALENDAR","BILTEN_1_1","BILTEN_1_2","BILTEN_1_3","BILTEN_1_POREDAK","BILTEN_2_1","BILTEN_2_2","BILTEN_2_3","BILTEN_2_4","BILTEN_2_POREDAK","WEB_DATA","WEB_JSON"],"not_rendered":{"charts":1,"images":3,"macros":1,"external_links":0,"defined_names":65,"comments":0,"pivot_tables":0},"unopened":[],"bounds":{"document_bytes":16777216,"sheet_cells":100000,"rows_first":2000,"rows_last":500,"rows_between":2000,"halvings":0,"cell_chars":16384,"cell_head_chars":4096},"cells_cut":0,"cells_raw":0,"read":"whole","date_system":"1900"}

{"sheet":"EKIPE I IGRAČI","index":0,"n_rows":24,"n_cols":14,"rows_kept":24,"cut":false,"hidden":true,"merged":[]}
["Popis ekipa (A2:A13)","Broj ekipa (auto)",{"$f":"A2","v":"ARENA FERRO"},{"$f":"A3","v":"BROVINJE 2"},{"$f":"A4","v":"BUZET 1"},{"$f":"A5","v":"BUZET 2"},{"$f":"A6","v":"MAESTRAL 2"},{"$f":"A7","v":"PAZIN"},{"$f":"A8","v":"VAL SHARK"},{"$f":"A9","v":0},{"$f":"A10","v":0},{"$f":"A11","v":0},{"$f":"A12","v":0},{"$f":"A13","v":0}]
["ARENA FERRO",{"$f":"MAX(0,COUNTA($A$2:$A$13))","v":7},"CINKOPAN Eduard","BASIACO Leonida","BERDNYK Stanislav","BOŠNJAKOVIĆ Dubravko","MILAKOVIĆ Borna","LUKEZ Goran","INFANTOLINO Davide"]
["BROVINJE 2",null,"CINKOPAN Kristijan","DOBRIĆ Raymond","KRANČIĆ Filip","DRAŠĆIĆ Petar","BRAJKOVIĆ Danko","LUKEZ Kristijan","DELEVIĆ Predrag"]
["BUZET 1",null,"KELEMEN Mićo","GASPARI HUDOLETNJAK Matija","PAULUS Michael","FLEGO Valter","SRŠA Branko","NADIŠIĆ Mauro","IVINIĆ Fabio"]
["BUZET 2",null,"KRIŠTO Tomislav","RAJKOVIĆ Karlo","SIROTIĆ Aleš","KOS Dino","SINČIĆ Luana","BAKŠA Alen","IVINIĆ Serđo"]
["MAESTRAL 2",null,"PEKICA Bartol","BENAZIĆ Sandro","SIROTIĆ Kevin","KRBAVČIĆ Dragan","VIŽINTIN Marino","FABRIS Karlo","HRVANOVIĆ Jasmin"]
["PAZIN",null,"VINOVRŠKI Jenisej","JURIŠIĆ Ivan","BERDNYK S., PAULUS M.","PAVLETIĆ Guido","SMAIĆ Bruno","FABIJAN Damir","MEDAKOVIĆ Željko"]
["VAL SHARK",null,"VALE Damir","STIPIĆ Matea","SIROTIĆ A., KRANČIĆ F.","DRAŠĆIĆ P., PAVLETIĆ G.","POSEDEL Branko","GLAVINIĆ Denis","HRVANOVIĆ J., IVINIĆ S."]
[null,null,"KRANJC Dino","BERNAZ Sara","SIROTIĆ K., BERDNYK S.","KOS D., PAVLETIĆ G.","HANZL Tomislav","TONČIĆ Miro","INFANTOLINO D., HRVANOVIĆ J."]
[null,null,"CINKOPAN K., PEKICA B.","BENAZIĆ S., BASIACO L.","SIROTIĆ A., BERDNYK S.","DRAŠĆIĆ P., KOS D.","BELUŠIĆ Zoran","PUŽAR Dražen","DELEVIĆ P., IVINIĆ S."]
[null,null,"CINKOPAN K., KELEMEN M.","BASIACO L., GASPARI HUDOLETNJAK",1,"FLEGO V., KOS D.","PEROŠ Ana","LUKEZ Leo","HRVANOVIĆ J., IVINIĆ S."]
[null,null,"CINKOPAN K., KRANJC D.","BENAZIĆ S., GASPARI HUDOLETNJAK",2,1,"SREBRNIĆ BANKO Ivana","LUKEZ Ana",1]
[null,null,"KELEMEN M., KRANJC D.",1,3,2,"LAKIĆ Marija","LABAŠ Tomo Anton",2]
[null,null,1,2,4,3,"MILAKOVIĆ B., SINČIĆ L.","GLAVINIĆ D., LUKEZ G.",3]
[null,null,2,3,5,4,"KMET T., HANZL T.","GLAVINIĆ D., FABIJAN D.",4]
[null,null,3,4,6,5,"KMET Teo",1,5]
[null,null,4,5,7,6,"KMET T., SINČIĆ L.",2,6]
[null,null,5,6,8,7,"KMET T., VIŽINTIN M.",3,7]
[null,null,6,7,9,8,"SINČIĆ L., PEROŠ A.",4,8]
[null,null,7,8,10,9,1,5,9]
[null,null,8,9,11,10,2,6,10]
[null,null,9,10,12,11,3,7,11]
[null,null,10,11,13,12,4,8,12]
[null,null,11,12,14,13,5,9,13]

{"sheet":"UPUTE","index":1,"n_rows":21,"n_cols":2,"rows_kept":21,"cut":false,"hidden":false,"merged":[]}
[null,"UPUTE ZA UPISIVANJE REZULTATA U SUDAC_ZAPISNIK"]
["1.","U Zapisniku imaš nekoliko padajućih popisa koje samo trebaš odabrati."]
["2.","Polje B3 – kad klikneš na polje sa strane se pojavi strelica. Klikom ti se otvara mogućnost da odabereš grad gdje se igralo."]
["3.","Polje E3 – na isti način izaberi dvoranu"]
["4.","Polje J3 – izaberi kolo"]
["5.","Polje N3 – izaberi datum"]
["6.","Polje T3 – izaberi sat"]
["7.","Polje B4 – izaberi ekipu domaćina iz padajućeg popisa. Najprije moraš izabrati ekipu da bi mogao dodati igrače. Na poljima B5:B9 iz padajućeg popisa izaberi igrače domaćina. Isto to ponoviš na poljima B12:B20. Do polja B20 samo ako je ukupni rezultat npr 4 : 3 to znači da je odigrano svih sedam mečeva. Na poljima B16 i B17 izaberi igrače u paru. Bitno je da isti par uvijek birate istim redom kako bi se mogao raditi i rangiranje parova. Ako u drugom kolu navedete imena obrnuto program to tretira kao novi par."]
["8.","Polje E4 –izaberi ekipu gostiju iz padajućeg popisa. Najprije moraš izabrati ekipu da bi mogao dodati igrače. Na poljima E5:E9 iz padajućeg popisa izaberi igrače gostiju. Isto to ponoviš na poljima E12:E20. Do polja E20 samo ako je ukupni rezultat npr 4 : 3 to znači da je odigrano svih sedam mečeva. Na poljima E16 i E17 biraš igrače u paru. Bitno je da isti par uvijek birate istim redom kako bi se mogao raditi i rangiranje parova. Ako u drugom kolu navedete imena obrnuto program to tretira kao novi par."]
["9.","Rezultate po setovima upisuješ u plava polja počevši od polja  F13. Znači poene upisuješ u širim stupcima F, H, I, K, L, N, O, Q, R, T. Najlakše ćete to napraviti pomoću tipke TAB (vidi sliku). 1. Klikni u polje F13. 2. Upiši poene za prvi set domaćeg igrača 3. Pritisni tipku TAB, automatski te prebacuje u polje H13 za upisivanje poena za prvi set gostujućeg igrača ... Sve ostalo se izračunava automatski. Kad upišeš sve poene u prvom meču, klikneš na polje F14 za upisivanje poena drugog meča itd."]
["10.","Ispunjeni zapisnik poslati na mail liga@stsiz.hr"]
[]
[]
[null,"UPUTE ZA UPISIVANJE NOVIH IGRAČA U SUDAC_EKIPE"]
["1.","Ako imate novog igrača koji nije do sada igrao i nije u bazi igrača i ne pojavljuje se u padajućem popisu, možete ga sami dodati. Stavite napomenu u mailu tako da ga ja mogu dodati u glavnu bazu igrača."]
["2.","Svaki klub ima svoj stupac počevši od Arene Ferro u stupcu C nadalje. Nove igrače upisujete točno u stupcu ispod imena kluba na prvo slobodno polje. Nemojte preskakati redove."]
["3.","Igrače upisujete PREZIME Ime. Dakle npr. DOBRIĆ Igor. Nemojte pisati sve velikim slovima nego TOČNO ovako kako sam dao u primjeru. Pazite da vam ne ostane razmak ispred ili iza, pazite da između prezimena i imene ne lupite dva razmaka. Svaku takvu stvar program vodi kao novog igrača pa će biti krive rang liste igrača."]
["4.","Vodite računa da ne može igrati igrač bez valjanog liječničkog pregleda."]
["5.","Kad igrača upišete u SUDAC_EKIPE, moći ćete ga odabrati na popisu u SUDAC_ZAPISNIK."]
["6.","Ne upisujte skupa igrače u paru. Sad se biraju kao pojedinci na poljima B16:B17 odnosno E16:E17 u SUDAC_ZAPISNIK. Ovo što vidite na popisu gdje su parovi upisani u isto polje je iz prvog dijela sezone. Dakle, u drugom dijelu sezone par birate s popisa igrača pojedinačno."]
["7.","POMOĆ: Igor Dobrić, tel: 091 556 48 54; mail: liga@stsiz.hr"]

{"sheet":"SUDAC_EKIPE","index":2,"n_rows":19,"n_cols":14,"rows_kept":19,"cut":false,"hidden":false,"merged":[]}
["Popis ekipa (A2:A13)","Broj ekipa (auto)",{"$f":"A2","v":"ARENA FERRO"},{"$f":"A3","v":"BROVINJE 2"},{"$f":"A4","v":"BUZET 1"},{"$f":"A5","v":"BUZET 2"},{"$f":"A6","v":"MAESTRAL 2"},{"$f":"A7","v":"PAZIN"},{"$f":"A8","v":"VAL SHARK"},{"$f":"A9","v":0},{"$f":"A10","v":0},{"$f":"A11","v":0},{"$f":"A12","v":0},{"$f":"A13","v":0}]
["ARENA FERRO",{"$f":"MAX(0,COUNTA($A$2:$A$13))","v":7},"CINKOPAN Eduard","BASIACO Leonida","BERDNYK Stanislav","BOŠNJAKOVIĆ Dubravko","MILAKOVIĆ Borna","LUKEZ Goran","INFANTOLINO Davide"]
["BROVINJE 2",null,"CINKOPAN Kristijan","DOBRIĆ Raymond","KRANČIĆ Filip","DRAŠĆIĆ Petar","BRAJKOVIĆ Danko","LUKEZ Kristijan","DELEVIĆ Predrag"]
["BUZET 1",null,"KELEMEN Mićo","GASPARI HUDOLETNJAK Matija","PAULUS Michael","FLEGO Valter","SRŠA Branko","NADIŠIĆ Mauro","IVINIĆ Fabio"]
["BUZET 2",null,"KRIŠTO Tomislav","RAJKOVIĆ Karlo","SIROTIĆ Aleš","KOS Dino","SINČIĆ Luana","BAKŠA Alen","IVINIĆ Serđo"]
["MAESTRAL 2",null,"PEKICA Bartol","BENAZIĆ Sandro","SIROTIĆ Kevin","KRBAVČIĆ Dragan","VIŽINTIN Marino","FABRIS Karlo","HRVANOVIĆ Jasmin"]
["PAZIN",null,"VINOVRŠKI Jenisej","JURIŠIĆ Ivan","BERDNYK S., PAULUS M.","PAVLETIĆ Guido","SMAIĆ Bruno","FABIJAN Damir","MEDAKOVIĆ Željko"]
["VAL SHARK",null,"VALE Damir","STIPIĆ Matea","SIROTIĆ A., KRANČIĆ F.","DRAŠĆIĆ P., PAVLETIĆ G.","POSEDEL Branko","GLAVINIĆ Denis","HRVANOVIĆ J., IVINIĆ S."]
[null,null,"KRANJC Dino","BERNAZ Sara","SIROTIĆ K., BERDNYK S.","KOS D., PAVLETIĆ G.","HANZL Tomislav","TONČIĆ Miro","INFANTOLINO D., HRVANOVIĆ J."]
[null,null,"CINKOPAN K., PEKICA B.","BENAZIĆ S., BASIACO L.","SIROTIĆ A., BERDNYK S.","DRAŠĆIĆ P., KOS D.","BELUŠIĆ Zoran","PUŽAR Dražen","DELEVIĆ P., IVINIĆ S."]
[null,null,"CINKOPAN K., KELEMEN M.","BASIACO L., GASPARI HUDOLETNJAK",null,"FLEGO V., KOS D.","PEROŠ Ana","LUKEZ Leo","HRVANOVIĆ J., IVINIĆ S."]
[null,null,"CINKOPAN K., KRANJC D.","BENAZIĆ S., GASPARI HUDOLETNJAK",null,null,"SREBRNIĆ BANKO Ivana","LUKEZ Ana"]
[null,null,"KELEMEN M., KRANJC D.",null,null,null,"LAKIĆ Marija","LABAŠ Tomo Anton"]
[null,null,null,null,null,null,"MILAKOVIĆ B., SINČIĆ L.","GLAVINIĆ D., LUKEZ G."]
[null,null,null,null,null,null,"KMET T., HANZL T.","GLAVINIĆ D., FABIJAN D."]
[null,null,null,null,null,null,"KMET Teo"]
[null,null,null,null,null,null,"KMET T., SINČIĆ L."]
[null,null,null,null,null,null,"KMET T., VIŽINTIN M."]
[null,null,null,null,null,null,"SINČIĆ L., PEROŠ A."]

{"sheet":"ZAPISNIK MEČA","index":3,"n_rows":51,"n_cols":48,"rows_kept":51,"cut":false,"hidden":true,"merged":[[2,23,2,27],[0,0,0,27],[1,4,1,8],[1,9,1,12],[1,13,1,18],[1,19,1,22],[1,1,1,3],[1,23,1,27],[2,1,2,3],[2,4,2,8],[2,9,2,12],[2,13,2,18],[2,19,2,22]]}
["ŽUPANIJSKA LIGA STSIŽ 2025./2026.",null,null,null,null,null,null,null,null,null,null,null,null,null,null,null,null,null,null,null,null,null,null,null,null,null,null,null,null,null,null,null,null,null,null,null,null,null,null,null,null,null,null,null,null,null,null,"EDIT"]
[null,"GRAD DOMAĆIN",null,null,"DVORANA",null,null,null,null,"KOLO",null,null,null,"DATUM",null,null,null,null,null,"SAT",null,null,null,null,null,null,null,null,null,null,null,null,null,{"$f":"'EKIPE I IGRAČI'!$C$1","v":"ARENA FERRO"},{"$f":"IFERROR(INDEX('EKIPE I IGRAČI'!$C$2:$N$51, ROWS($A$1:A1), MATCH($B$4, 'EKIPE I IGRAČI'!$C$1:$N$1, 0)), \"\")","v":0},{"$f":"IFERROR(INDEX('EKIPE I IGRAČI'!$C$2:$N$51, ROWS($A$1:A1), MATCH($E$4, 'EKIPE I IGRAČI'!$C$1:$N$1, 0)), \"\")","v":0},{"$f":"IFERROR(INDEX('EKIPE I IGRAČI'!$C$2:$N$51, ROWS($A$1:A1), MATCH($B$12, 'EKIPE I IGRAČI'!$C$1:$N$1, 0)), \"\")","v":"LUKEZ Goran"},{"$f":"IFERROR(INDEX('EKIPE I IGRAČI'!$C$2:$N$51, ROWS($A$1:A1), MATCH($E$12, 'EKIPE I IGRAČI'!$C$1:$N$1, 0)), \"\")","v":0}]
[null,"-",null,null,"-",null,null,null,null,"-",null,null,null,"1. 9. 2025.",null,null,null,null,null,null,null,null,null,null,null,null,null,null,null,null,null,null,null,{"$f":"'EKIPE I IGRAČI'!$D$1","v":"BROVINJE 2"},{"$f":"IFERROR(INDEX('EKIPE I IGRAČI'!$C$2:$N$51, ROWS($A$1:A2), MATCH($B$4, 'EKIPE I IGRAČI'!$C$1:$N$1, 0)), \"\")","v":0},{"$f":"IFERROR(INDEX('EKIPE I IGRAČI'!$C$2:$N$51, ROWS($A$1:A2), MATCH($E$4, 'EKIPE I IGRAČI'!$C$1:$N$1, 0)), \"\")","v":0},{"$f":"IFERROR(INDEX('EKIPE I IGRAČI'!$C$2:$N$51, ROWS($A$1:A2), MATCH($B$12, 'EKIPE I IGRAČI'!$C$1:$N$1, 0)), \"\")","v":"LUKEZ Kristijan"},{"$f":"IFERROR(INDEX('EKIPE I IGRAČI'!$C$2:$N$51, ROWS($A$1:A2), MATCH($E$12, 'EKIPE I IGRAČI'!$C$1:$N$1, 0)), \"\")","v":0}]
["Domaćin",0,null,"Gost",0,null,null,null,null,null,null,null,null,"Gost",null,null,null,null,null,null,null,null,null,null,null,null,null,null,null,null,null,null,null,{"$f":"'EKIPE I IGRAČI'!$E$1","v":"BUZET 1"},{"$f":"IFERROR(INDEX('EKIPE I IGRAČI'!$C$2:$N$51, ROWS($A$1:A3), MATCH($B$4, 'EKIPE I IGRAČI'!$C$1:$N$1, 0)), \"\")","v":0},{"$f":"IFERROR(INDEX('EKIPE I IGRAČI'!$C$2:$N$51, ROWS($A$1:A3), MATCH($E$4, 'EKIPE I IGRAČI'!$C$1:$N$1, 0)), \"\")","v":0},{"$f":"IFERROR(INDEX('EKIPE I IGRAČI'!$C$2:$N$51, ROWS($A$1:A3), MATCH($B$12, 'EKIPE I IGRAČI'!$C$1:$N$1, 0)), \"\")","v":"NADIŠIĆ Mauro"},{"$f":"IFERROR(INDEX('EKIPE I IGRAČI'!$C$2:$N$51, ROWS($A$1:A3), MATCH($E$12, 'EKIPE I IGRAČI'!$C$1:$N$1, 0)), \"\")","v":0}]
["A",null,null,"X",null,null,null,null,null,null,null,null,null,null,null,null,null,null,null,null,null,null,null,null,null,null,null,null,null,null,null,null,null,{"$f":"'EKIPE I IGRAČI'!$F$1","v":"BUZET 2"},{"$f":"IFERROR(INDEX('EKIPE I IGRAČI'!$C$2:$N$51, ROWS($A$1:A4), MATCH($B$4, 'EKIPE I IGRAČI'!$C$1:$N$1, 0)), \"\")","v":0},{"$f":"IFERROR(INDEX('EKIPE I IGRAČI'!$C$2:$N$51, ROWS($A$1:A4), MATCH($E$4, 'EKIPE I IGRAČI'!$C$1:$N$1, 0)), \"\")","v":0},{"$f":"IFERROR(INDEX('EKIPE I IGRAČI'!$C$2:$N$51, ROWS($A$1:A4), MATCH($B$12, 'EKIPE I IGRAČI'!$C$1:$N$1, 0)), \"\")","v":"BAKŠA Alen"},{"$f":"IFERROR(INDEX('EKIPE I IGRAČI'!$C$2:$N$51, ROWS($A$1:A4), MATCH($E$12, 'EKIPE I IGRAČI'!$C$1:$N$1, 0)), \"\")","v":0}]
["B",null,null,"Y",null,null,null,null,null,null,null,null,null,null,null,null,null,null,null,null,null,null,null,null,null,null,null,null," ",null,null,null,null,{"$f":"'EKIPE I IGRAČI'!$G$1","v":"MAESTRAL 2"},{"$f":"IFERROR(INDEX('EKIPE I IGRAČI'!$C$2:$N$51, ROWS($A$1:A5), MATCH($B$4, 'EKIPE I IGRAČI'!$C$1:$N$1, 0)), \"\")","v":0},{"$f":"IFERROR(INDEX('EKIPE I IGRAČI'!$C$2:$N$51, ROWS($A$1:A5), MATCH($E$4, 'EKIPE I IGRAČI'!$C$1:$N$1, 0)), \"\")","v":0},{"$f":"IFERROR(INDEX('EKIPE I IGRAČI'!$C$2:$N$51, ROWS($A$1:A5), MATCH($B$12, 'EKIPE I IGRAČI'!$C$1:$N$1, 0)), \"\")","v":"FABRIS Karlo"},{"$f":"IFERROR(INDEX('EKIPE I IGRAČI'!$C$2:$N$51, ROWS($A$1:A5), MATCH($E$12, 'EKIPE I IGRAČI'!$C$1:$N$1, 0)), \"\")","v":0}]
["C",null,null,"Z",null,null,null,null,null,null," ",null,null,null,null,null,null,null,null,null,null,null,null,null,null,null,null,null,null,null,null,null,null,{"$f":"'EKIPE I IGRAČI'!$H$1","v":"PAZIN"},{"$f":"IFERROR(INDEX('EKIPE I IGRAČI'!$C$2:$N$51, ROWS($A$1:A6), MATCH($B$4, 'EKIPE I IGRAČI'!$C$1:$N$1, 0)), \"\")","v":0},{"$f":"IFERROR(INDEX('EKIPE I IGRAČI'!$C$2:$N$51, ROWS($A$1:A6), MATCH($E$4, 'EKIPE I IGRAČI'!$C$1:$N$1, 0)), \"\")","v":0},{"$f":"IFERROR(INDEX('EKIPE I IGRAČI'!$C$2:$N$51, ROWS($A$1:A6), MATCH($B$12, 'EKIPE I IGRAČI'!$C$1:$N$1, 0)), \"\")","v":"FABIJAN Damir"},{"$f":"IFERROR(INDEX('EKIPE I IGRAČI'!$C$2:$N$51, ROWS($A$1:A6), MATCH($E$12, 'EKIPE I IGRAČI'!$C$1:$N$1, 0)), \"\")","v":0}]
["R1",null,null,"R1",null,null,null,null,null,null,null,null,null,null,null,null,null,null,null,null,null,null,null,null,null,null,null,null,null,null,null,null,null,{"$f":"'EKIPE I IGRAČI'!$I$1","v":"VAL SHARK"},{"$f":"IFERROR(INDEX('EKIPE I IGRAČI'!$C$2:$N$51, ROWS($A$1:A7), MATCH($B$4, 'EKIPE I IGRAČI'!$C$1:$N$1, 0)), \"\")","v":0},{"$f":"IFERROR(INDEX('EKIPE I IGRAČI'!$C$2:$N$51, ROWS($A$1:A7), MATCH($E$4, 'EKIPE I IGRAČI'!$C$1:$N$1, 0)), \"\")","v":0},{"$f":"IFERROR(INDEX('EKIPE I IGRAČI'!$C$2:$N$51, ROWS($A$1:A7), MATCH($B$12, 'EKIPE I IGRAČI'!$C$1:$N$1, 0)), \"\")","v":"GLAVINIĆ Denis"},{"$f":"IFERROR(INDEX('EKIPE I IGRAČI'!$C$2:$N$51, ROWS($A$1:A7), MATCH($E$12, 'EKIPE I IGRAČI'!$C$1:$N$1, 0)), \"\")","v":0}]
["R2",null,null,"R2",null,null,null,null,null,null,null,null,null,null,null,null,null,null,null,null,null,null,null,null,null,null,null,null,null,null,null,null,null,{"$f":"'EKIPE I IGRAČI'!$J$1","v":0},{"$f":"IFERROR(INDEX('EKIPE I IGRAČI'!$C$2:$N$51, ROWS($A$1:A8), MATCH($B$4, 'EKIPE I IGRAČI'!$C$1:$N$1, 0)), \"\")","v":0},{"$f":"IFERROR(INDEX('EKIPE I IGRAČI'!$C$2:$N$51, ROWS($A$1:A8), MATCH($E$4, 'EKIPE I IGRAČI'!$C$1:$N$1, 0)), \"\")","v":0},{"$f":"IFERROR(INDEX('EKIPE I IGRAČI'!$C$2:$N$51, ROWS($A$1:A8), MATCH($B$12, 'EKIPE I IGRAČI'!$C$1:$N$1, 0)), \"\")","v":"TONČIĆ Miro"},{"$f":"IFERROR(INDEX('EKIPE I IGRAČI'!$C$2:$N$51, ROWS($A$1:A8), MATCH($E$12, 'EKIPE I IGRAČI'!$C$1:$N$1, 0)), \"\")","v":0}]
[null,null,null,null,null,null,null,null,null,null,null,null,null,null,null,null,null,null,null,null,null,null,null,null,null,null,null,null,null,null,null,null,null,{"$f":"'EKIPE I IGRAČI'!$K$1","v":0},{"$f":"IFERROR(INDEX('EKIPE I IGRAČI'!$C$2:$N$51, ROWS($A$1:A9), MATCH($B$4, 'EKIPE I IGRAČI'!$C$1:$N$1, 0)), \"\")","v":0},{"$f":"IFERROR(INDEX('EKIPE I IGRAČI'!$C$2:$N$51, ROWS($A$1:A9), MATCH($E$4, 'EKIPE I IGRAČI'!$C$1:$N$1, 0)), \"\")","v":0},{"$f":"IFERROR(INDEX('EKIPE I IGRAČI'!$C$2:$N$51, ROWS($A$1:A9), MATCH($B$12, 'EKIPE I IGRAČI'!$C$1:$N$1, 0)), \"\")","v":"PUŽAR Dražen"},{"$f":"IFERROR(INDEX('EKIPE I IGRAČI'!$C$2:$N$51, ROWS($A$1:A9), MATCH($E$12, 'EKIPE I IGRAČI'!$C$1:$N$1, 0)), \"\")","v":0}]
[null,"DOMAĆIN",null,null,"GOST",null,null,null," ",null,null,null,null,null,null,null,null,null,null,null,null,null,null,null,null,null,null,null,null,null,null,null,null,{"$f":"'EKIPE I IGRAČI'!$L$1","v":0},{"$f":"IFERROR(INDEX('EKIPE I IGRAČI'!$C$2:$N$51, ROWS($A$1:A10), MATCH($B$4, 'EKIPE I IGRAČI'!$C$1:$N$1, 0)), \"\")","v":0},{"$f":"IFERROR(INDEX('EKIPE I IGRAČI'!$C$2:$N$51, ROWS($A$1:A10), MATCH($E$4, 'EKIPE I IGRAČI'!$C$1:$N$1, 0)), \"\")","v":0},{"$f":"IFERROR(INDEX('EKIPE I IGRAČI'!$C$2:$N$51, ROWS($A$1:A10), MATCH($B$12, 'EKIPE I IGRAČI'!$C$1:$N$1, 0)), \"\")","v":"LUKEZ Leo"},{"$f":"IFERROR(INDEX('EKIPE I IGRAČI'!$C$2:$N$51, ROWS($A$1:A10), MATCH($E$12, 'EKIPE I IGRAČI'!$C$1:$N$1, 0)), \"\")","v":0}]
[null,"PAZIN",null,null,0,null,null,null,null,null,null,null,null,null,null,null,null,null,null,null,null,null,null,null,null,null,null,null,null,null,null,null,null,{"$f":"'EKIPE I IGRAČI'!$M$1","v":0},{"$f":"IFERROR(INDEX('EKIPE I IGRAČI'!$C$2:$N$51, ROWS($A$1:A11), MATCH($B$4, 'EKIPE I IGRAČI'!$C$1:$N$1, 0)), \"\")","v":0},{"$f":"IFERROR(INDEX('EKIPE I IGRAČI'!$C$2:$N$51, ROWS($A$1:A11), MATCH($E$4, 'EKIPE I IGRAČI'!$C$1:$N$1, 0)), \"\")","v":0},{"$f":"IFERROR(INDEX('EKIPE I IGRAČI'!$C$2:$N$51, ROWS($A$1:A11), MATCH($B$12, 'EKIPE I IGRAČI'!$C$1:$N$1, 0)), \"\")","v":"LUKEZ Ana"},{"$f":"IFERROR(INDEX('EKIPE I IGRAČI'!$C$2:$N$51, ROWS($A$1:A11), MATCH($E$12, 'EKIPE I IGRAČI'!$C$1:$N$1, 0)), \"\")","v":0}]
[null,null,"A","X",null,null,":",null,null,":",null,null,":",null,null,":",null,null,":",null,null,{"$f":"IF(COUNTA(F13:T13)=0,\"\",_xlfn.LET(_xlpm.h,CHOOSE({1,2,3,4,5},F13,I13,L13,O13,R13),_xlpm.a,CHOOSE({1,2,3,4,5},H13,K13,N13,Q13,T13),SUM((_xlpm.h>_xlpm.a)*(_xlpm.h<>\"\")*(_xlpm.a<>\"\"))))","v":0},":",{"$f":"IF(COUNTA(F13:T13)=0,\"\",_xlfn.LET(_xlpm.h,CHOOSE({1,2,3,4,5},F13,I13,L13,O13,R13),_xlpm.a,CHOOSE({1,2,3,4,5},H13,K13,N13,Q13,T13),SUM((_xlpm.a>_xlpm.h)*(_xlpm.h<>\"\")*(_xlpm.a<>\"\"))))","v":0},{"$f":"IF(OR(V13=\"\",X13=\"\"),\"\",IF(MAX(V13,X13)<3,\"\",SUMPRODUCT(--($V$13:V13>$X$13:X13),--(($V$13:V13>=3)+($X$13:X13>=3)>0))))","v":""},":",{"$f":"IF(OR(V13=\"\",X13=\"\"),\"\",IF(MAX(V13,X13)<3,\"\",SUMPRODUCT(--($X$13:X13>$V$13:V13),--(($V$13:V13>=3)+($X$13:X13>=3)>0))))","v":""},null,null,null,null,null,null,{"$f":"'EKIPE I IGRAČI'!$N$1","v":0},{"$f":"IFERROR(INDEX('EKIPE I IGRAČI'!$C$2:$N$51, ROWS($A$1:A12), MATCH($B$4, 'EKIPE I IGRAČI'!$C$1:$N$1, 0)), \"\")","v":0},{"$f":"IFERROR(INDEX('EKIPE I IGRAČI'!$C$2:$N$51, ROWS($A$1:A12), MATCH($E$4, 'EKIPE I IGRAČI'!$C$1:$N$1, 0)), \"\")","v":0},{"$f":"IFERROR(INDEX('EKIPE I IGRAČI'!$C$2:$N$51, ROWS($A$1:A12), MATCH($B$12, 'EKIPE I IGRAČI'!$C$1:$N$1, 0)), \"\")","v":"LABAŠ Tomo Anton"},{"$f":"IFERROR(INDEX('EKIPE I IGRAČI'!$C$2:$N$51, ROWS($A$1:A12), MATCH($E$12, 'EKIPE I IGRAČI'!$C$1:$N$1, 0)), \"\")","v":0}]
[null,null,"B","Y",null,null,":",null,null,":",null,null,":",null,null,":",null,null,":",null,null,{"$f":"IF(COUNTA(F14:T14)=0,\"\",_xlfn.LET(_xlpm.h,CHOOSE({1,2,3,4,5},F14,I14,L14,O14,R14),_xlpm.a,CHOOSE({1,2,3,4,5},H14,K14,N14,Q14,T14),SUM((_xlpm.h>_xlpm.a)*(_xlpm.h<>\"\")*(_xlpm.a<>\"\"))))","v":0},":",{"$f":"IF(COUNTA(F14:T14)=0,\"\",_xlfn.LET(_xlpm.h,CHOOSE({1,2,3,4,5},F14,I14,L14,O14,R14),_xlpm.a,CHOOSE({1,2,3,4,5},H14,K14,N14,Q14,T14),SUM((_xlpm.a>_xlpm.h)*(_xlpm.h<>\"\")*(_xlpm.a<>\"\"))))","v":0},{"$f":"IF(OR(V14=\"\",X14=\"\"),\"\",IF(MAX(V14,X14)<3,\"\",SUMPRODUCT(--($V$13:V14>$X$13:X14),--(($V$13:V14>=3)+($X$13:X14>=3)>0))))","v":""},":",{"$f":"IF(OR(V14=\"\",X14=\"\"),\"\",IF(MAX(V14,X14)<3,\"\",SUMPRODUCT(--($X$13:X14>$V$13:V14),--(($V$13:V14>=3)+($X$13:X14>=3)>0))))","v":""},null,null,null,null,null,null,null,{"$f":"IFERROR(INDEX('EKIPE I IGRAČI'!$C$2:$N$51, ROWS($A$1:A13), MATCH($B$4, 'EKIPE I IGRAČI'!$C$1:$N$1, 0)), \"\")","v":0},{"$f":"IFERROR(INDEX('EKIPE I IGRAČI'!$C$2:$N$51, ROWS($A$1:A13), MATCH($E$4, 'EKIPE I IGRAČI'!$C$1:$N$1, 0)), \"\")","v":0},{"$f":"IFERROR(INDEX('EKIPE I IGRAČI'!$C$2:$N$51, ROWS($A$1:A13), MATCH($B$12, 'EKIPE I IGRAČI'!$C$1:$N$1, 0)), \"\")","v":"GLAVINIĆ D., LUKEZ G."},{"$f":"IFERROR(INDEX('EKIPE I IGRAČI'!$C$2:$N$51, ROWS($A$1:A13), MATCH($E$12, 'EKIPE I IGRAČI'!$C$1:$N$1, 0)), \"\")","v":0}]
[null,null,"C","Z",null,null,":",null,null,":",null,null,":",null,null,":",null,null,":",null,null,{"$f":"IF(COUNTA(F15:T15)=0,\"\",_xlfn.LET(_xlpm.h,CHOOSE({1,2,3,4,5},F15,I15,L15,O15,R15),_xlpm.a,CHOOSE({1,2,3,4,5},H15,K15,N15,Q15,T15),SUM((_xlpm.h>_xlpm.a)*(_xlpm.h<>\"\")*(_xlpm.a<>\"\"))))","v":0},":",{"$f":"IF(COUNTA(F15:T15)=0,\"\",_xlfn.LET(_xlpm.h,CHOOSE({1,2,3,4,5},F15,I15,L15,O15,R15),_xlpm.a,CHOOSE({1,2,3,4,5},H15,K15,N15,Q15,T15),SUM((_xlpm.a>_xlpm.h)*(_xlpm.h<>\"\")*(_xlpm.a<>\"\"))))","v":0},{"$f":"IF(OR(V15=\"\",X15=\"\"),\"\",IF(MAX(V15,X15)<3,\"\",SUMPRODUCT(--($V$13:V15>$X$13:X15),--(($V$13:V15>=3)+($X$13:X15>=3)>0))))","v":""},":",{"$f":"IF(OR(V15=\"\",X15=\"\"),\"\",IF(MAX(V15,X15)<3,\"\",SUMPRODUCT(--($X$13:X15>$V$13:V15),--(($V$13:V15>=3)+($X$13:X15>=3)>0))))","v":""},null,null,null,null,null,null,null,{"$f":"IFERROR(INDEX('EKIPE I IGRAČI'!$C$2:$N$51, ROWS($A$1:A14), MATCH($B$4, 'EKIPE I IGRAČI'!$C$1:$N$1, 0)), \"\")","v":0},{"$f":"IFERROR(INDEX('EKIPE I IGRAČI'!$C$2:$N$51, ROWS($A$1:A14), MATCH($E$4, 'EKIPE I IGRAČI'!$C$1:$N$1, 0)), \"\")","v":0},{"$f":"IFERROR(INDEX('EKIPE I IGRAČI'!$C$2:$N$51, ROWS($A$1:A14), MATCH($B$12, 'EKIPE I IGRAČI'!$C$1:$N$1, 0)), \"\")","v":"GLAVINIĆ D., FABIJAN D."},{"$f":"IFERROR(INDEX('EKIPE I IGRAČI'!$C$2:$N$51, ROWS($A$1:A14), MATCH($E$12, 'EKIPE I IGRAČI'!$C$1:$N$1, 0)), \"\")","v":0}]
[null,0,"PAR","PAR",0,null,":",null,null,":",null,null,":",null,null,":",null,null,":",null,null,{"$f":"IF(COUNTA(F16:T16)=0,\"\",_xlfn.LET(_xlpm.h,CHOOSE({1,2,3,4,5},F16,I16,L16,O16,R16),_xlpm.a,CHOOSE({1,2,3,4,5},H16,K16,N16,Q16,T16),SUM((_xlpm.h>_xlpm.a)*(_xlpm.h<>\"\")*(_xlpm.a<>\"\"))))","v":0},":",{"$f":"IF(COUNTA(F16:T16)=0,\"\",_xlfn.LET(_xlpm.h,CHOOSE({1,2,3,4,5},F16,I16,L16,O16,R16),_xlpm.a,CHOOSE({1,2,3,4,5},H16,K16,N16,Q16,T16),SUM((_xlpm.a>_xlpm.h)*(_xlpm.h<>\"\")*(_xlpm.a<>\"\"))))","v":0},{"$f":"IF(OR(V16=\"\",X16=\"\"),\"\",IF(MAX(V16,X16)<3,\"\",SUMPRODUCT(--($V$13:V16>$X$13:X16),--(($V$13:V16>=3)+($X$13:X16>=3)>0))))","v":""},":",{"$f":"IF(OR(V16=\"\",X16=\"\"),\"\",IF(MAX(V16,X16)<3,\"\",SUMPRODUCT(--($X$13:X16>$V$13:V16),--(($V$13:V16>=3)+($X$13:X16>=3)>0))))","v":""},null,null,null,null,null,null,null,{"$f":"IFERROR(INDEX('EKIPE I IGRAČI'!$C$2:$N$51, ROWS($A$1:A15), MATCH($B$4, 'EKIPE I IGRAČI'!$C$1:$N$1, 0)), \"\")","v":0},{"$f":"IFERROR(INDEX('EKIPE I IGRAČI'!$C$2:$N$51, ROWS($A$1:A15), MATCH($E$4, 'EKIPE I IGRAČI'!$C$1:$N$1, 0)), \"\")","v":0},{"$f":"IFERROR(INDEX('EKIPE I IGRAČI'!$C$2:$N$51, ROWS($A$1:A15), MATCH($B$12, 'EKIPE I IGRAČI'!$C$1:$N$1, 0)), \"\")","v":1},{"$f":"IFERROR(INDEX('EKIPE I IGRAČI'!$C$2:$N$51, ROWS($A$1:A15), MATCH($E$12, 'EKIPE I IGRAČI'!$C$1:$N$1, 0)), \"\")","v":0}]
[null,0,"PAR","PAR",0,null,":",null,null,":",null,null,":",null,null,":",null,null,":",null,null,{"$f":"IF(COUNTA(F17:T17)=0,\"\",_xlfn.LET(_xlpm.h,CHOOSE({1,2,3,4,5},F17,I17,L17,O17,R17),_xlpm.a,CHOOSE({1,2,3,4,5},H17,K17,N17,Q17,T17),SUM((_xlpm.h>_xlpm.a)*(_xlpm.h<>\"\")*(_xlpm.a<>\"\"))))","v":0},":",{"$f":"IF(COUNTA(F17:T17)=0,\"\",_xlfn.LET(_xlpm.h,CHOOSE({1,2,3,4,5},F17,I17,L17,O17,R17),_xlpm.a,CHOOSE({1,2,3,4,5},H17,K17,N17,Q17,T17),SUM((_xlpm.a>_xlpm.h)*(_xlpm.h<>\"\")*(_xlpm.a<>\"\"))))","v":0},{"$f":"IF(OR(V17=\"\",X17=\"\"),\"\",IF(MAX(V17,X17)<3,\"\",SUMPRODUCT(--($V$13:V17>$X$13:X17),--(($V$13:V17>=3)+($X$13:X17>=3)>0))))","v":""},":",{"$f":"IF(OR(V17=\"\",X17=\"\"),\"\",IF(MAX(V17,X17)<3,\"\",SUMPRODUCT(--($X$13:X17>$V$13:V17),--(($V$13:V17>=3)+($X$13:X17>=3)>0))))","v":""},null,null,null,null,null,null,null,{"$f":"IFERROR(INDEX('EKIPE I IGRAČI'!$C$2:$N$51, ROWS($A$1:A16), MATCH($B$4, 'EKIPE I IGRAČI'!$C$1:$N$1, 0)), \"\")","v":0},{"$f":"IFERROR(INDEX('EKIPE I IGRAČI'!$C$2:$N$51, ROWS($A$1:A16), MATCH($E$4, 'EKIPE I IGRAČI'!$C$1:$N$1, 0)), \"\")","v":0},{"$f":"IFERROR(INDEX('EKIPE I IGRAČI'!$C$2:$N$51, ROWS($A$1:A16), MATCH($B$12, 'EKIPE I IGRAČI'!$C$1:$N$1, 0)), \"\")","v":2},{"$f":"IFERROR(INDEX('EKIPE I IGRAČI'!$C$2:$N$51, ROWS($A$1:A16), MATCH($E$12, 'EKIPE I IGRAČI'!$C$1:$N$1, 0)), \"\")","v":0}]
[null,null,"A","Y",null,null,":",null,null,":",null,null,":",null,null,":",null,null,":",null,null,{"$f":"IF(COUNTA(F18:T18)=0,\"\",_xlfn.LET(_xlpm.h,CHOOSE({1,2,3,4,5},F18,I18,L18,O18,R18),_xlpm.a,CHOOSE({1,2,3,4,5},H18,K18,N18,Q18,T18),SUM((_xlpm.h>_xlpm.a)*(_xlpm.h<>\"\")*(_xlpm.a<>\"\"))))","v":0},":",{"$f":"IF(COUNTA(F18:T18)=0,\"\",_xlfn.LET(_xlpm.h,CHOOSE({1,2,3,4,5},F18,I18,L18,O18,R18),_xlpm.a,CHOOSE({1,2,3,4,5},H18,K18,N18,Q18,T18),SUM((_xlpm.a>_xlpm.h)*(_xlpm.h<>\"\")*(_xlpm.a<>\"\"))))","v":0},{"$f":"IF(OR(V18=\"\",X18=\"\"),\"\",IF(MAX(V18,X18)<3,\"\",SUMPRODUCT(--($V$13:V18>$X$13:X18),--(($V$13:V18>=3)+($X$13:X18>=3)>0))))","v":""},":",{"$f":"IF(OR(V18=\"\",X18=\"\"),\"\",IF(MAX(V18,X18)<3,\"\",SUMPRODUCT(--($X$13:X18>$V$13:V18),--(($V$13:V18>=3)+($X$13:X18>=3)>0))))","v":""},null,null,null,null,null,null,null,{"$f":"IFERROR(INDEX('EKIPE I IGRAČI'!$C$2:$N$51, ROWS($A$1:A17), MATCH($B$4, 'EKIPE I IGRAČI'!$C$1:$N$1, 0)), \"\")","v":0},{"$f":"IFERROR(INDEX('EKIPE I IGRAČI'!$C$2:$N$51, ROWS($A$1:A17), MATCH($E$4, 'EKIPE I IGRAČI'!$C$1:$N$1, 0)), \"\")","v":0},{"$f":"IFERROR(INDEX('EKIPE I IGRAČI'!$C$2:$N$51, ROWS($A$1:A17), MATCH($B$12, 'EKIPE I IGRAČI'!$C$1:$N$1, 0)), \"\")","v":3},{"$f":"IFERROR(INDEX('EKIPE I IGRAČI'!$C$2:$N$51, ROWS($A$1:A17), MATCH($E$12, 'EKIPE I IGRAČI'!$C$1:$N$1, 0)), \"\")","v":0}]
[null,null,"C","X",null,null,":",null,null,":",null,null,":",null,null,":",null,null,":",null,null,{"$f":"IF(COUNTA(F19:T19)=0,\"\",_xlfn.LET(_xlpm.h,CHOOSE({1,2,3,4,5},F19,I19,L19,O19,R19),_xlpm.a,CHOOSE({1,2,3,4,5},H19,K19,N19,Q19,T19),SUM((_xlpm.h>_xlpm.a)*(_xlpm.h<>\"\")*(_xlpm.a<>\"\"))))","v":0},":",{"$f":"IF(COUNTA(F19:T19)=0,\"\",_xlfn.LET(_xlpm.h,CHOOSE({1,2,3,4,5},F19,I19,L19,O19,R19),_xlpm.a,CHOOSE({1,2,3,4,5},H19,K19,N19,Q19,T19),SUM((_xlpm.a>_xlpm.h)*(_xlpm.h<>\"\")*(_xlpm.a<>\"\"))))","v":0},{"$f":"IF(OR(V19=\"\",X19=\"\"),\"\",IF(MAX(V19,X19)<3,\"\",SUMPRODUCT(--($V$13:V19>$X$13:X19),--(($V$13:V19>=3)+($X$13:X19>=3)>0))))","v":""},":",{"$f":"IF(OR(V19=\"\",X19=\"\"),\"\",IF(MAX(V19,X19)<3,\"\",SUMPRODUCT(--($X$13:X19>$V$13:V19),--(($V$13:V19>=3)+($X$13:X19>=3)>0))))","v":""},null,null,null,null,null,null,null,{"$f":"IFERROR(INDEX('EKIPE I IGRAČI'!$C$2:$N$51, ROWS($A$1:A18), MATCH($B$4, 'EKIPE I IGRAČI'!$C$1:$N$1, 0)), \"\")","v":0},{"$f":"IFERROR(INDEX('EKIPE I IGRAČI'!$C$2:$N$51, ROWS($A$1:A18), MATCH($E$4, 'EKIPE I IGRAČI'!$C$1:$N$1, 0)), \"\")","v":0},{"$f":"IFERROR(INDEX('EKIPE I IGRAČI'!$C$2:$N$51, ROWS($A$1:A18), MATCH($B$12, 'EKIPE I IGRAČI'!$C$1:$N$1, 0)), \"\")","v":4},{"$f":"IFERROR(INDEX('EKIPE I IGRAČI'!$C$2:$N$51, ROWS($A$1:A18), MATCH($E$12, 'EKIPE I IGRAČI'!$C$1:$N$1, 0)), \"\")","v":0}]
[null,null,"B","Z",null,null,":",null,null,":",null,null,":",null,null,":",null,null,":",null,null,{"$f":"IF(COUNTA(F20:T20)=0,\"\",_xlfn.LET(_xlpm.h,CHOOSE({1,2,3,4,5},F20,I20,L20,O20,R20),_xlpm.a,CHOOSE({1,2,3,4,5},H20,K20,N20,Q20,T20),SUM((_xlpm.h>_xlpm.a)*(_xlpm.h<>\"\")*(_xlpm.a<>\"\"))))","v":0},":",{"$f":"IF(COUNTA(F20:T20)=0,\"\",_xlfn.LET(_xlpm.h,CHOOSE({1,2,3,4,5},F20,I20,L20,O20,R20),_xlpm.a,CHOOSE({1,2,3,4,5},H20,K20,N20,Q20,T20),SUM((_xlpm.a>_xlpm.h)*(_xlpm.h<>\"\")*(_xlpm.a<>\"\"))))","v":0},{"$f":"IF(OR(V20=\"\",X20=\"\"),\"\",IF(MAX(V20,X20)<3,\"\",SUMPRODUCT(--($V$13:V20>$X$13:X20),--(($V$13:V20>=3)+($X$13:X20>=3)>0))))","v":""},":",{"$f":"IF(OR(V20=\"\",X20=\"\"),\"\",IF(MAX(V20,X20)<3,\"\",SUMPRODUCT(--($X$13:X20>$V$13:V20),--(($V$13:V20>=3)+($X$13:X20>=3)>0))))","v":""},null,null,null,null,null,null,null,{"$f":"IFERROR(INDEX('EKIPE I IGRAČI'!$C$2:$N$51, ROWS($A$1:A19), MATCH($B$4, 'EKIPE I IGRAČI'!$C$1:$N$1, 0)), \"\")","v":0},{"$f":"IFERROR(INDEX('EKIPE I IGRAČI'!$C$2:$N$51, ROWS($A$1:A19), MATCH($E$4, 'EKIPE I IGRAČI'!$C$1:$N$1, 0)), \"\")","v":0},{"$f":"IFERROR(INDEX('EKIPE I IGRAČI'!$C$2:$N$51, ROWS($A$1:A19), MATCH($B$12, 'EKIPE I IGRAČI'!$C$1:$N$1, 0)), \"\")","v":5},{"$f":"IFERROR(INDEX('EKIPE I IGRAČI'!$C$2:$N$51, ROWS($A$1:A19), MATCH($E$12, 'EKIPE I IGRAČI'!$C$1:$N$1, 0)), \"\")","v":0}]
[null,{"$f":"IF(OR(B16=\"\",B17=\"\"),\"\",IF(B16<B17,B16&\" – \"&B17,B17&\" – \"&B16))","v":"0 – 0"},null,null,{"$f":"IF(OR(E16=\"\",E17=\"\"),\"\",IF(E16<E17,E16&\" – \"&E17,E17&\" – \"&E16))","v":"0 – 0"},null,null,null,null,null,null,null,null,null,null,null,null,null,null,null,null,null,null,null,null,null,null,null,null,null,null,null,null,null,{"$f":"IFERROR(INDEX('EKIPE I IGRAČI'!$C$2:$N$51, ROWS($A$1:A20), MATCH($B$4, 'EKIPE I IGRAČI'!$C$1:$N$1, 0)), \"\")","v":0},{"$f":"IFERROR(INDEX('EKIPE I IGRAČI'!$C$2:$N$51, ROWS($A$1:A20), MATCH($E$4, 'EKIPE I IGRAČI'!$C$1:$N$1, 0)), \"\")","v":0},{"$f":"IFERROR(INDEX('EKIPE I IGRAČI'!$C$2:$N$51, ROWS($A$1:A20), MATCH($B$12, 'EKIPE I IGRAČI'!$C$1:$N$1, 0)), \"\")","v":6},{"$f":"IFERROR(INDEX('EKIPE I IGRAČI'!$C$2:$N$51, ROWS($A$1:A20), MATCH($E$12, 'EKIPE I IGRAČI'!$C$1:$N$1, 0)), \"\")","v":0}]
[null,{"$f":"B4","v":0},":",null,{"$f":"E4","v":0},{"$f":"MAX(Y13:Y20)","v":0},":",{"$f":"MAX(AA13:AA20)","v":0},null,null,null,null,null,null,null,null,null,null,null,null,null,null,null,null,null,null,null,null,null,null,null,null,null,null,{"$f":"IFERROR(INDEX('EKIPE I IGRAČI'!$C$2:$N$51, ROWS($A$1:A21), MATCH($B$4, 'EKIPE I IGRAČI'!$C$1:$N$1, 0)), \"\")","v":0},{"$f":"IFERROR(INDEX('EKIPE I IGRAČI'!$C$2:$N$51, ROWS($A$1:A21), MATCH($E$4, 'EKIPE I IGRAČI'!$C$1:$N$1, 0)), \"\")","v":0},{"$f":"IFERROR(INDEX('EKIPE I IGRAČI'!$C$2:$N$51, ROWS($A$1:A21), MATCH($B$12, 'EKIPE I IGRAČI'!$C$1:$N$1, 0)), \"\")","v":7},{"$f":"IFERROR(INDEX('EKIPE I IGRAČI'!$C$2:$N$51, ROWS($A$1:A21), MATCH($E$12, 'EKIPE I IGRAČI'!$C$1:$N$1, 0)), \"\")","v":0}]
[null,null,null,null,"SETOVI",{"$f":"SUM(V13:V20)","v":0},":",{"$f":"SUM(X13:X20)","v":0},null,null,null,null,null,null,null,null,null,null,null,null,null,null,null,null,null,null,null,null,null,null,null,null,null,null,{"$f":"IFERROR(INDEX('EKIPE I IGRAČI'!$C$2:$N$51, ROWS($A$1:A22), MATCH($B$4, 'EKIPE I IGRAČI'!$C$1:$N$1, 0)), \"\")","v":0},{"$f":"IFERROR(INDEX('EKIPE I IGRAČI'!$C$2:$N$51, ROWS($A$1:A22), MATCH($E$4, 'EKIPE I IGRAČI'!$C$1:$N$1, 0)), \"\")","v":0},{"$f":"IFERROR(INDEX('EKIPE I IGRAČI'!$C$2:$N$51, ROWS($A$1:A22), MATCH($B$12, 'EKIPE I IGRAČI'!$C$1:$N$1, 0)), \"\")","v":8},{"$f":"IFERROR(INDEX('EKIPE I IGRAČI'!$C$2:$N$51, ROWS($A$1:A22), MATCH($E$12, 'EKIPE I IGRAČI'!$C$1:$N$1, 0)), \"\")","v":0}]
[null,null,null,null,"POENI",{"$f":"SUM(F13:F20, I13:I20, L13:L20, O13:O20, R13:R20)","v":0},":",{"$f":"SUM(H13:H20, K13:K20, N13:N20, Q13:Q20, T13:T20)","v":0},null,null,null,null,null,null,null,null,null,null,null,null,null,null,null,null,null,null,null,null,null,null,null,null,null,null,{"$f":"IFERROR(INDEX('EKIPE I IGRAČI'!$C$2:$N$51, ROWS($A$1:A23), MATCH($B$4, 'EKIPE I IGRAČI'!$C$1:$N$1, 0)), \"\")","v":0},{"$f":"IFERROR(INDEX('EKIPE I IGRAČI'!$C$2:$N$51, ROWS($A$1:A23), MATCH($E$4, 'EKIPE I IGRAČI'!$C$1:$N$1, 0)), \"\")","v":0},{"$f":"IFERROR(INDEX('EKIPE I IGRAČI'!$C$2:$N$51, ROWS($A$1:A23), MATCH($B$12, 'EKIPE I IGRAČI'!$C$1:$N$1, 0)), \"\")","v":9},{"$f":"IFERROR(INDEX('EKIPE I IGRAČI'!$C$2:$N$51, ROWS($A$1:A23), MATCH($E$12, 'EKIPE I IGRAČI'!$C$1:$N$1, 0)), \"\")","v":0}]
[null,null,null,null,null,null,null,null,null,null,null,null,null,null,null,null,null,null,null,null,null,null,null,null,null,null,null,null,null,null,null,null,null,null,{"$f":"IFERROR(INDEX('EKIPE I IGRAČI'!$C$2:$N$51, ROWS($A$1:A24), MATCH($B$4, 'EKIPE I IGRAČI'!$C$1:$N$1, 0)), \"\")","v":0},{"$f":"IFERROR(INDEX('EKIPE I IGRAČI'!$C$2:$N$51, ROWS($A$1:A24), MATCH($E$4, 'EKIPE I IGRAČI'!$C$1:$N$1, 0)), \"\")","v":0},{"$f":"IFERROR(INDEX('EKIPE I IGRAČI'!$C$2:$N$51, ROWS($A$1:A24), MATCH($B$12, 'EKIPE I IGRAČI'!$C$1:$N$1, 0)), \"\")","v":0},{"$f":"IFERROR(INDEX('EKIPE I IGRAČI'!$C$2:$N$51, ROWS($A$1:A24), MATCH($E$12, 'EKIPE I IGRAČI'!$C$1:$N$1, 0)), \"\")","v":0}]
[null,null,null,null,null,null,null,null,null,null,null,null,null,null,null,null,null,null,null,null,null,null,null,null,null,null,null,null,null,null,null,null,null,null,{"$f":"IFERROR(INDEX('EKIPE I IGRAČI'!$C$2:$N$51, ROWS($A$1:A25), MATCH($B$4, 'EKIPE I IGRAČI'!$C$1:$N$1, 0)), \"\")","v":0},{"$f":"IFERROR(INDEX('EKIPE I IGRAČI'!$C$2:$N$51, ROWS($A$1:A25), MATCH($E$4, 'EKIPE I IGRAČI'!$C$1:$N$1, 0)), \"\")","v":0},{"$f":"IFERROR(INDEX('EKIPE I IGRAČI'!$C$2:$N$51, ROWS($A$1:A25), MATCH($B$12, 'EKIPE I IGRAČI'!$C$1:$N$1, 0)), \"\")","v":0},{"$f":"IFERROR(INDEX('EKIPE I IGRAČI'!$C$2:$N$51, ROWS($A$1:A25), MATCH($E$12, 'EKIPE I IGRAČI'!$C$1:$N$1, 0)), \"\")","v":0}]
[null,null,null,null,null,null,null,null,null,null,null,null,null,null,null,null,null,null,null,null,null,null,null,null,null,null,null,null,null,null,null,null,null,null,{"$f":"IFERROR(INDEX('EKIPE I IGRAČI'!$C$2:$N$51, ROWS($A$1:A26), MATCH($B$4, 'EKIPE I IGRAČI'!$C$1:$N$1, 0)), \"\")","v":0},{"$f":"IFERROR(INDEX('EKIPE I IGRAČI'!$C$2:$N$51, ROWS($A$1:A26), MATCH($E$4, 'EKIPE I IGRAČI'!$C$1:$N$1, 0)), \"\")","v":0},{"$f":"IFERROR(INDEX('EKIPE I IGRAČI'!$C$2:$N$51, ROWS($A$1:A26), MATCH($B$12, 'EKIPE I IGRAČI'!$C$1:$N$1, 0)), \"\")","v":0},{"$f":"IFERROR(INDEX('EKIPE I IGRAČI'!$C$2:$N$51, ROWS($A$1:A26), MATCH($E$12, 'EKIPE I IGRAČI'!$C$1:$N$1, 0)), \"\")","v":0}]
[null,null,null,null,null,null,null,null,null,null,null,null,null,null,null,null,null,null,null,null,null,null,null,null,null,null,null,null,null,null,null,null,null,null,{"$f":"IFERROR(INDEX('EKIPE I IGRAČI'!$C$2:$N$51, ROWS($A$1:A27), MATCH($B$4, 'EKIPE I IGRAČI'!$C$1:$N$1, 0)), \"\")","v":0},{"$f":"IFERROR(INDEX('EKIPE I IGRAČI'!$C$2:$N$51, ROWS($A$1:A27), MATCH($E$4, 'EKIPE I IGRAČI'!$C$1:$N$1, 0)), \"\")","v":0},{"$f":"IFERROR(INDEX('EKIPE I IGRAČI'!$C$2:$N$51, ROWS($A$1:A27), MATCH($B$12, 'EKIPE I IGRAČI'!$C$1:$N$1, 0)), \"\")","v":0},{"$f":"IFERROR(INDEX('EKIPE I IGRAČI'!$C$2:$N$51, ROWS($A$1:A27), MATCH($E$12, 'EKIPE I IGRAČI'!$C$1:$N$1, 0)), \"\")","v":0}]
[null,null,null,null,null,null,null,null,null,null,null,null,null,null,null,null,null,null,null,null,null,null,null,null,null,null,null,null,null,null,null,null,null,null,{"$f":"IFERROR(INDEX('EKIPE I IGRAČI'!$C$2:$N$51, ROWS($A$1:A28), MATCH($B$4, 'EKIPE I IGRAČI'!$C$1:$N$1, 0)), \"\")","v":0},{"$f":"IFERROR(INDEX('EKIPE I IGRAČI'!$C$2:$N$51, ROWS($A$1:A28), MATCH($E$4, 'EKIPE I IGRAČI'!$C$1:$N$1, 0)), \"\")","v":0},{"$f":"IFERROR(INDEX('EKIPE I IGRAČI'!$C$2:$N$51, ROWS($A$1:A28), MATCH($B$12, 'EKIPE I IGRAČI'!$C$1:$N$1, 0)), \"\")","v":0},{"$f":"IFERROR(INDEX('EKIPE I IGRAČI'!$C$2:$N$51, ROWS($A$1:A28), MATCH($E$12, 'EKIPE I IGRAČI'!$C$1:$N$1, 0)), \"\")","v":0}]
[null,null,null,null,null,null,null,null,null,null,null,null,null,null,null,null,null,null,null,null,null,null,null,null,null,null,null,null,null,null,null,null,null,null,{"$f":"IFERROR(INDEX('EKIPE I IGRAČI'!$C$2:$N$51, ROWS($A$1:A29), MATCH($B$4, 'EKIPE I IGRAČI'!$C$1:$N$1, 0)), \"\")","v":0},{"$f":"IFERROR(INDEX('EKIPE I IGRAČI'!$C$2:$N$51, ROWS($A$1:A29), MATCH($E$4, 'EKIPE I IGRAČI'!$C$1:$N$1, 0)), \"\")","v":0},{"$f":"IFERROR(INDEX('EKIPE I IGRAČI'!$C$2:$N$51, ROWS($A$1:A29), MATCH($B$12, 'EKIPE I IGRAČI'!$C$1:$N$1, 0)), \"\")","v":0},{"$f":"IFERROR(INDEX('EKIPE I IGRAČI'!$C$2:$N$51, ROWS($A$1:A29), MATCH($E$12, 'EKIPE I IGRAČI'!$C$1:$N$1, 0)), \"\")","v":0}]
[null,null,null,null,null,null,null,null,null,null,null,null,null,null,null,null,null,null,null,null,null,null,null,null,null,null,null,null,null,null,null,null,null,null,{"$f":"IFERROR(INDEX('EKIPE I IGRAČI'!$C$2:$N$51, ROWS($A$1:A30), MATCH($B$4, 'EKIPE I IGRAČI'!$C$1:$N$1, 0)), \"\")","v":0},{"$f":"IFERROR(INDEX('EKIPE I IGRAČI'!$C$2:$N$51, ROWS($A$1:A30), MATCH($E$4, 'EKIPE I IGRAČI'!$C$1:$N$1, 0)), \"\")","v":0},{"$f":"IFERROR(INDEX('EKIPE I IGRAČI'!$C$2:$N$51, ROWS($A$1:A30), MATCH($B$12, 'EKIPE I IGRAČI'!$C$1:$N$1, 0)), \"\")","v":0},{"$f":"IFERROR(INDEX('EKIPE I IGRAČI'!$C$2:$N$51, ROWS($A$1:A30), MATCH($E$12, 'EKIPE I IGRAČI'!$C$1:$N$1, 0)), \"\")","v":0}]
[null,null,null,null,null,null,null,null,null,null,null,null,null,null,null,null,null,null,null,null,null,null,null,null,null,null,null,null,null,null,null,null,null,null,{"$f":"IFERROR(INDEX('EKIPE I IGRAČI'!$C$2:$N$51, ROWS($A$1:A31), MATCH($B$4, 'EKIPE I IGRAČI'!$C$1:$N$1, 0)), \"\")","v":0},{"$f":"IFERROR(INDEX('EKIPE I IGRAČI'!$C$2:$N$51, ROWS($A$1:A31), MATCH($E$4, 'EKIPE I IGRAČI'!$C$1:$N$1, 0)), \"\")","v":0},{"$f":"IFERROR(INDEX('EKIPE I IGRAČI'!$C$2:$N$51, ROWS($A$1:A31), MATCH($B$12, 'EKIPE I IGRAČI'!$C$1:$N$1, 0)), \"\")","v":0},{"$f":"IFERROR(INDEX('EKIPE I IGRAČI'!$C$2:$N$51, ROWS($A$1:A31), MATCH($E$12, 'EKIPE I IGRAČI'!$C$1:$N$1, 0)), \"\")","v":0}]
[null,null,null,null,null,null,null,null,null,null,null,null,null,null,null,null,null,null,null,null,null,null,null,null,null,null,null,null,null,null,null,null,null,null,{"$f":"IFERROR(INDEX('EKIPE I IGRAČI'!$C$2:$N$51, ROWS($A$1:A32), MATCH($B$4, 'EKIPE I IGRAČI'!$C$1:$N$1, 0)), \"\")","v":0},{"$f":"IFERROR(INDEX('EKIPE I IGRAČI'!$C$2:$N$51, ROWS($A$1:A32), MATCH($E$4, 'EKIPE I IGRAČI'!$C$1:$N$1, 0)), \"\")","v":0},{"$f":"IFERROR(INDEX('EKIPE I IGRAČI'!$C$2:$N$51, ROWS($A$1:A32), MATCH($B$12, 'EKIPE I IGRAČI'!$C$1:$N$1, 0)), \"\")","v":0},{"$f":"IFERROR(INDEX('EKIPE I IGRAČI'!$C$2:$N$51, ROWS($A$1:A32), MATCH($E$12, 'EKIPE I IGRAČI'!$C$1:$N$1, 0)), \"\")","v":0}]
[null,null,null,null,null,null,null,null,null,null,null,null,null,null,null,null,null,null,null,null,null,null,null,null,null,null,null,null,null,null,null,null,null,null,{"$f":"IFERROR(INDEX('EKIPE I IGRAČI'!$C$2:$N$51, ROWS($A$1:A33), MATCH($B$4, 'EKIPE I IGRAČI'!$C$1:$N$1, 0)), \"\")","v":0},{"$f":"IFERROR(INDEX('EKIPE I IGRAČI'!$C$2:$N$51, ROWS($A$1:A33), MATCH($E$4, 'EKIPE I IGRAČI'!$C$1:$N$1, 0)), \"\")","v":0},{"$f":"IFERROR(INDEX('EKIPE I IGRAČI'!$C$2:$N$51, ROWS($A$1:A33), MATCH($B$12, 'EKIPE I IGRAČI'!$C$1:$N$1, 0)), \"\")","v":0},{"$f":"IFERROR(INDEX('EKIPE I IGRAČI'!$C$2:$N$51, ROWS($A$1:A33), MATCH($E$12, 'EKIPE I IGRAČI'!$C$1:$N$1, 0)), \"\")","v":0}]
[null,null,null,null,null,null,null,null,null,null,null,null,null,null,null,null,null,null,null,null,null,null,null,null,null,null,null,null,null,null,null,null,null,null,{"$f":"IFERROR(INDEX('EKIPE I IGRAČI'!$C$2:$N$51, ROWS($A$1:A34), MATCH($B$4, 'EKIPE I IGRAČI'!$C$1:$N$1, 0)), \"\")","v":0},{"$f":"IFERROR(INDEX('EKIPE I IGRAČI'!$C$2:$N$51, ROWS($A$1:A34), MATCH($E$4, 'EKIPE I IGRAČI'!$C$1:$N$1, 0)), \"\")","v":0},{"$f":"IFERROR(INDEX('EKIPE I IGRAČI'!$C$2:$N$51, ROWS($A$1:A34), MATCH($B$12, 'EKIPE I IGRAČI'!$C$1:$N$1, 0)), \"\")","v":0},{"$f":"IFERROR(INDEX('EKIPE I IGRAČI'!$C$2:$N$51, ROWS($A$1:A34), MATCH($E$12, 'EKIPE I IGRAČI'!$C$1:$N$1, 0)), \"\")","v":0}]
[null,null,null,null,null,null,null,null,null,null,null,null,null,null,null,null,null,null,null,null,null,null,null,null,null,null,null,null,null,null,null,null,null,null,{"$f":"IFERROR(INDEX('EKIPE I IGRAČI'!$C$2:$N$51, ROWS($A$1:A35), MATCH($B$4, 'EKIPE I IGRAČI'!$C$1:$N$1, 0)), \"\")","v":0},{"$f":"IFERROR(INDEX('EKIPE I IGRAČI'!$C$2:$N$51, ROWS($A$1:A35), MATCH($E$4, 'EKIPE I IGRAČI'!$C$1:$N$1, 0)), \"\")","v":0},{"$f":"IFERROR(INDEX('EKIPE I IGRAČI'!$C$2:$N$51, ROWS($A$1:A35), MATCH($B$12, 'EKIPE I IGRAČI'!$C$1:$N$1, 0)), \"\")","v":0},{"$f":"IFERROR(INDEX('EKIPE I IGRAČI'!$C$2:$N$51, ROWS($A$1:A35), MATCH($E$12, 'EKIPE I IGRAČI'!$C$1:$N$1, 0)), \"\")","v":0}]
[null,null,null,null,null,null,null,null,null,null,null,null,null,null,null,null,null,null,null,null,null,null,null,null,null,null,null,null,null,null,null,null,null,null,{"$f":"IFERROR(INDEX('EKIPE I IGRAČI'!$C$2:$N$51, ROWS($A$1:A36), MATCH($B$4, 'EKIPE I IGRAČI'!$C$1:$N$1, 0)), \"\")","v":0},{"$f":"IFERROR(INDEX('EKIPE I IGRAČI'!$C$2:$N$51, ROWS($A$1:A36), MATCH($E$4, 'EKIPE I IGRAČI'!$C$1:$N$1, 0)), \"\")","v":0},{"$f":"IFERROR(INDEX('EKIPE I IGRAČI'!$C$2:$N$51, ROWS($A$1:A36), MATCH($B$12, 'EKIPE I IGRAČI'!$C$1:$N$1, 0)), \"\")","v":0},{"$f":"IFERROR(INDEX('EKIPE I IGRAČI'!$C$2:$N$51, ROWS($A$1:A36), MATCH($E$12, 'EKIPE I IGRAČI'!$C$1:$N$1, 0)), \"\")","v":0}]
[null,null,null,null,null,null,null,null,null,null,null,null,null,null,null,null,null,null,null,null,null,null,null,null,null,null,null,null,null,null,null,null,null,null,{"$f":"IFERROR(INDEX('EKIPE I IGRAČI'!$C$2:$N$51, ROWS($A$1:A37), MATCH($B$4, 'EKIPE I IGRAČI'!$C$1:$N$1, 0)), \"\")","v":0},{"$f":"IFERROR(INDEX('EKIPE I IGRAČI'!$C$2:$N$51, ROWS($A$1:A37), MATCH($E$4, 'EKIPE I IGRAČI'!$C$1:$N$1, 0)), \"\")","v":0},{"$f":"IFERROR(INDEX('EKIPE I IGRAČI'!$C$2:$N$51, ROWS($A$1:A37), MATCH($B$12, 'EKIPE I IGRAČI'!$C$1:$N$1, 0)), \"\")","v":0},{"$f":"IFERROR(INDEX('EKIPE I IGRAČI'!$C$2:$N$51, ROWS($A$1:A37), MATCH($E$12, 'EKIPE I IGRAČI'!$C$1:$N$1, 0)), \"\")","v":0}]
[null,null,null,null,null,null,null,null,null,null,null,null,null,null,null,null,null,null,null,null,null,null,null,null,null,null,null,null,null,null,null,null,null,null,{"$f":"IFERROR(INDEX('EKIPE I IGRAČI'!$C$2:$N$51, ROWS($A$1:A38), MATCH($B$4, 'EKIPE I IGRAČI'!$C$1:$N$1, 0)), \"\")","v":0},{"$f":"IFERROR(INDEX('EKIPE I IGRAČI'!$C$2:$N$51, ROWS($A$1:A38), MATCH($E$4, 'EKIPE I IGRAČI'!$C$1:$N$1, 0)), \"\")","v":0},{"$f":"IFERROR(INDEX('EKIPE I IGRAČI'!$C$2:$N$51, ROWS($A$1:A38), MATCH($B$12, 'EKIPE I IGRAČI'!$C$1:$N$1, 0)), \"\")","v":0},{"$f":"IFERROR(INDEX('EKIPE I IGRAČI'!$C$2:$N$51, ROWS($A$1:A38), MATCH($E$12, 'EKIPE I IGRAČI'!$C$1:$N$1, 0)), \"\")","v":0}]
[null,null,null,null,null,null,null,null,null,null,null,null,null,null,null,null,null,null,null,null,null,null,null,null,null,null,null,null,null,null,null,null,null,null,{"$f":"IFERROR(INDEX('EKIPE I IGRAČI'!$C$2:$N$51, ROWS($A$1:A39), MATCH($B$4, 'EKIPE I IGRAČI'!$C$1:$N$1, 0)), \"\")","v":0},{"$f":"IFERROR(INDEX('EKIPE I IGRAČI'!$C$2:$N$51, ROWS($A$1:A39), MATCH($E$4, 'EKIPE I IGRAČI'!$C$1:$N$1, 0)), \"\")","v":0},{"$f":"IFERROR(INDEX('EKIPE I IGRAČI'!$C$2:$N$51, ROWS($A$1:A39), MATCH($B$12, 'EKIPE I IGRAČI'!$C$1:$N$1, 0)), \"\")","v":0},{"$f":"IFERROR(INDEX('EKIPE I IGRAČI'!$C$2:$N$51, ROWS($A$1:A39), MATCH($E$12, 'EKIPE I IGRAČI'!$C$1:$N$1, 0)), \"\")","v":0}]
[null,null,null,null,null,null,null,null,null,null,null,null,null,null,null,null,null,null,null,null,null,null,null,null,null,null,null,null,null,null,null,null,null,null,{"$f":"IFERROR(INDEX('EKIPE I IGRAČI'!$C$2:$N$51, ROWS($A$1:A40), MATCH($B$4, 'EKIPE I IGRAČI'!$C$1:$N$1, 0)), \"\")","v":0},{"$f":"IFERROR(INDEX('EKIPE I IGRAČI'!$C$2:$N$51, ROWS($A$1:A40), MATCH($E$4, 'EKIPE I IGRAČI'!$C$1:$N$1, 0)), \"\")","v":0},{"$f":"IFERROR(INDEX('EKIPE I IGRAČI'!$C$2:$N$51, ROWS($A$1:A40), MATCH($B$12, 'EKIPE I IGRAČI'!$C$1:$N$1, 0)), \"\")","v":0},{"$f":"IFERROR(INDEX('EKIPE I IGRAČI'!$C$2:$N$51, ROWS($A$1:A40), MATCH($E$12, 'EKIPE I IGRAČI'!$C$1:$N$1, 0)), \"\")","v":0}]
[null,null,null,null,null,null,null,null,null,null,null,null,null,null,null,null,null,null,null,null,null,null,null,null,null,null,null,null,null,null,null,null,null,null,{"$f":"IFERROR(INDEX('EKIPE I IGRAČI'!$C$2:$N$51, ROWS($A$1:A41), MATCH($B$4, 'EKIPE I IGRAČI'!$C$1:$N$1, 0)), \"\")","v":0},{"$f":"IFERROR(INDEX('EKIPE I IGRAČI'!$C$2:$N$51, ROWS($A$1:A41), MATCH($E$4, 'EKIPE I IGRAČI'!$C$1:$N$1, 0)), \"\")","v":0},{"$f":"IFERROR(INDEX('EKIPE I IGRAČI'!$C$2:$N$51, ROWS($A$1:A41), MATCH($B$12, 'EKIPE I IGRAČI'!$C$1:$N$1, 0)), \"\")","v":0},{"$f":"IFERROR(INDEX('EKIPE I IGRAČI'!$C$2:$N$51, ROWS($A$1:A41), MATCH($E$12, 'EKIPE I IGRAČI'!$C$1:$N$1, 0)), \"\")","v":0}]
[null,null,null,null,null,null,null,null,null,null,null,null,null,null,null,null,null,null,null,null,null,null,null,null,null,null,null,null,null,null,null,null,null,null,{"$f":"IFERROR(INDEX('EKIPE I IGRAČI'!$C$2:$N$51, ROWS($A$1:A42), MATCH($B$4, 'EKIPE I IGRAČI'!$C$1:$N$1, 0)), \"\")","v":0},{"$f":"IFERROR(INDEX('EKIPE I IGRAČI'!$C$2:$N$51, ROWS($A$1:A42), MATCH($E$4, 'EKIPE I IGRAČI'!$C$1:$N$1, 0)), \"\")","v":0},{"$f":"IFERROR(INDEX('EKIPE I IGRAČI'!$C$2:$N$51, ROWS($A$1:A42), MATCH($B$12, 'EKIPE I IGRAČI'!$C$1:$N$1, 0)), \"\")","v":0},{"$f":"IFERROR(INDEX('EKIPE I IGRAČI'!$C$2:$N$51, ROWS($A$1:A42), MATCH($E$12, 'EKIPE I IGRAČI'!$C$1:$N$1, 0)), \"\")","v":0}]
[null,null,null,null,null,null,null,null,null,null,null,null,null,null,null,null,null,null,null,null,null,null,null,null,null,null,null,null,null,null,null,null,null,null,{"$f":"IFERROR(INDEX('EKIPE I IGRAČI'!$C$2:$N$51, ROWS($A$1:A43), MATCH($B$4, 'EKIPE I IGRAČI'!$C$1:$N$1, 0)), \"\")","v":0},{"$f":"IFERROR(INDEX('EKIPE I IGRAČI'!$C$2:$N$51, ROWS($A$1:A43), MATCH($E$4, 'EKIPE I IGRAČI'!$C$1:$N$1, 0)), \"\")","v":0},{"$f":"IFERROR(INDEX('EKIPE I IGRAČI'!$C$2:$N$51, ROWS($A$1:A43), MATCH($B$12, 'EKIPE I IGRAČI'!$C$1:$N$1, 0)), \"\")","v":0},{"$f":"IFERROR(INDEX('EKIPE I IGRAČI'!$C$2:$N$51, ROWS($A$1:A43), MATCH($E$12, 'EKIPE I IGRAČI'!$C$1:$N$1, 0)), \"\")","v":0}]
[null,null,null,null,null,null,null,null,null,null,null,null,null,null,null,null,null,null,null,null,null,null,null,null,null,null,null,null,null,null,null,null,null,null,{"$f":"IFERROR(INDEX('EKIPE I IGRAČI'!$C$2:$N$51, ROWS($A$1:A44), MATCH($B$4, 'EKIPE I IGRAČI'!$C$1:$N$1, 0)), \"\")","v":0},{"$f":"IFERROR(INDEX('EKIPE I IGRAČI'!$C$2:$N$51, ROWS($A$1:A44), MATCH($E$4, 'EKIPE I IGRAČI'!$C$1:$N$1, 0)), \"\")","v":0},{"$f":"IFERROR(INDEX('EKIPE I IGRAČI'!$C$2:$N$51, ROWS($A$1:A44), MATCH($B$12, 'EKIPE I IGRAČI'!$C$1:$N$1, 0)), \"\")","v":0},{"$f":"IFERROR(INDEX('EKIPE I IGRAČI'!$C$2:$N$51, ROWS($A$1:A44), MATCH($E$12, 'EKIPE I IGRAČI'!$C$1:$N$1, 0)), \"\")","v":0}]
[null,null,null,null,null,null,null,null,null,null,null,null,null,null,null,null,null,null,null,null,null,null,null,null,null,null,null,null,null,null,null,null,null,null,{"$f":"IFERROR(INDEX('EKIPE I IGRAČI'!$C$2:$N$51, ROWS($A$1:A45), MATCH($B$4, 'EKIPE I IGRAČI'!$C$1:$N$1, 0)), \"\")","v":0},{"$f":"IFERROR(INDEX('EKIPE I IGRAČI'!$C$2:$N$51, ROWS($A$1:A45), MATCH($E$4, 'EKIPE I IGRAČI'!$C$1:$N$1, 0)), \"\")","v":0},{"$f":"IFERROR(INDEX('EKIPE I IGRAČI'!$C$2:$N$51, ROWS($A$1:A45), MATCH($B$12, 'EKIPE I IGRAČI'!$C$1:$N$1, 0)), \"\")","v":0},{"$f":"IFERROR(INDEX('EKIPE I IGRAČI'!$C$2:$N$51, ROWS($A$1:A45), MATCH($E$12, 'EKIPE I IGRAČI'!$C$1:$N$1, 0)), \"\")","v":0}]
[null,null,null,null,null,null,null,null,null,null,null,null,null,null,null,null,null,null,null,null,null,null,null,null,null,null,null,null,null,null,null,null,null,null,{"$f":"IFERROR(INDEX('EKIPE I IGRAČI'!$C$2:$N$51, ROWS($A$1:A46), MATCH($B$4, 'EKIPE I IGRAČI'!$C$1:$N$1, 0)), \"\")","v":0},{"$f":"IFERROR(INDEX('EKIPE I IGRAČI'!$C$2:$N$51, ROWS($A$1:A46), MATCH($E$4, 'EKIPE I IGRAČI'!$C$1:$N$1, 0)), \"\")","v":0},{"$f":"IFERROR(INDEX('EKIPE I IGRAČI'!$C$2:$N$51, ROWS($A$1:A46), MATCH($B$12, 'EKIPE I IGRAČI'!$C$1:$N$1, 0)), \"\")","v":0},{"$f":"IFERROR(INDEX('EKIPE I IGRAČI'!$C$2:$N$51, ROWS($A$1:A46), MATCH($E$12, 'EKIPE I IGRAČI'!$C$1:$N$1, 0)), \"\")","v":0}]
[null,null,null,null,null,null,null,null,null,null,null,null,null,null,null,null,null,null,null,null,null,null,null,null,null,null,null,null,null,null,null,null,null,null,{"$f":"IFERROR(INDEX('EKIPE I IGRAČI'!$C$2:$N$51, ROWS($A$1:A47), MATCH($B$4, 'EKIPE I IGRAČI'!$C$1:$N$1, 0)), \"\")","v":0},{"$f":"IFERROR(INDEX('EKIPE I IGRAČI'!$C$2:$N$51, ROWS($A$1:A47), MATCH($E$4, 'EKIPE I IGRAČI'!$C$1:$N$1, 0)), \"\")","v":0},{"$f":"IFERROR(INDEX('EKIPE I IGRAČI'!$C$2:$N$51, ROWS($A$1:A47), MATCH($B$12, 'EKIPE I IGRAČI'!$C$1:$N$1, 0)), \"\")","v":0},{"$f":"IFERROR(INDEX('EKIPE I IGRAČI'!$C$2:$N$51, ROWS($A$1:A47), MATCH($E$12, 'EKIPE I IGRAČI'!$C$1:$N$1, 0)), \"\")","v":0}]
[null,null,null,null,null,null,null,null,null,null,null,null,null,null,null,null,null,null,null,null,null,null,null,null,null,null,null,null,null,null,null,null,null,null,{"$f":"IFERROR(INDEX('EKIPE I IGRAČI'!$C$2:$N$51, ROWS($A$1:A48), MATCH($B$4, 'EKIPE I IGRAČI'!$C$1:$N$1, 0)), \"\")","v":0},{"$f":"IFERROR(INDEX('EKIPE I IGRAČI'!$C$2:$N$51, ROWS($A$1:A48), MATCH($E$4, 'EKIPE I IGRAČI'!$C$1:$N$1, 0)), \"\")","v":0},{"$f":"IFERROR(INDEX('EKIPE I IGRAČI'!$C$2:$N$51, ROWS($A$1:A48), MATCH($B$12, 'EKIPE I IGRAČI'!$C$1:$N$1, 0)), \"\")","v":0},{"$f":"IFERROR(INDEX('EKIPE I IGRAČI'!$C$2:$N$51, ROWS($A$1:A48), MATCH($E$12, 'EKIPE I IGRAČI'!$C$1:$N$1, 0)), \"\")","v":0}]
[null,null,null,null,null,null,null,null,null,null,null,null,null,null,null,null,null,null,null,null,null,null,null,null,null,null,null,null,null,null,null,null,null,null,{"$f":"IFERROR(INDEX('EKIPE I IGRAČI'!$C$2:$N$51, ROWS($A$1:A49), MATCH($B$4, 'EKIPE I IGRAČI'!$C$1:$N$1, 0)), \"\")","v":0},{"$f":"IFERROR(INDEX('EKIPE I IGRAČI'!$C$2:$N$51, ROWS($A$1:A49), MATCH($E$4, 'EKIPE I IGRAČI'!$C$1:$N$1, 0)), \"\")","v":0},{"$f":"IFERROR(INDEX('EKIPE I IGRAČI'!$C$2:$N$51, ROWS($A$1:A49), MATCH($B$12, 'EKIPE I IGRAČI'!$C$1:$N$1, 0)), \"\")","v":0},{"$f":"IFERROR(INDEX('EKIPE I IGRAČI'!$C$2:$N$51, ROWS($A$1:A49), MATCH($E$12, 'EKIPE I IGRAČI'!$C$1:$N$1, 0)), \"\")","v":0}]
[null,null,null,null,null,null,null,null,null,null,null,null,null,null,null,null,null,null,null,null,null,null,null,null,null,null,null,null,null,null,null,null,null,null,{"$f":"IFERROR(INDEX('EKIPE I IGRAČI'!$C$2:$N$51, ROWS($A$1:A50), MATCH($B$4, 'EKIPE I IGRAČI'!$C$1:$N$1, 0)), \"\")","v":0},{"$f":"IFERROR(INDEX('EKIPE I IGRAČI'!$C$2:$N$51, ROWS($A$1:A50), MATCH($E$4, 'EKIPE I IGRAČI'!$C$1:$N$1, 0)), \"\")","v":0},{"$f":"IFERROR(INDEX('EKIPE I IGRAČI'!$C$2:$N$51, ROWS($A$1:A50), MATCH($B$12, 'EKIPE I IGRAČI'!$C$1:$N$1, 0)), \"\")","v":0},{"$f":"IFERROR(INDEX('EKIPE I IGRAČI'!$C$2:$N$51, ROWS($A$1:A50), MATCH($E$12, 'EKIPE I IGRAČI'!$C$1:$N$1, 0)), \"\")","v":0}]

{"sheet":"SUDAC_ZAPISNIK","index":4,"n_rows":51,"n_cols":48,"rows_kept":51,"cut":false,"hidden":false,"merged":[[2,1,2,3],[2,4,2,8],[2,9,2,12],[2,13,2,18],[2,19,2,22],[2,23,2,27],[0,0,0,27],[1,1,1,3],[1,4,1,8],[1,9,1,12],[1,13,1,18],[1,19,1,22],[1,23,1,27]]}
["ŽUPANIJSKA LIGA STSIŽ 2025./2026.",null,null,null,null,null,null,null,null,null,null,null,null,null,null,null,null,null,null,null,null,null,null,null,null,null,null,null,null,null,null,null,null,null,null,null,null,null,null,null,null,null,null,null,null,null,null,"EDIT"]
[null,"GRAD DOMAĆIN",null,null,"DVORANA",null,null,null,null,"KOLO",null,null,null,"DATUM",null,null,null,null,null,"SAT",null,null,null,null,null,null,null,null,null,null,null,null,null,{"$f":"SUDAC_EKIPE!$C$1","v":"ARENA FERRO"},{"$f":"IFERROR(INDEX(SUDAC_EKIPE!$C$2:$N$51, ROWS($A$1:A1), MATCH($B$4, SUDAC_EKIPE!$C$1:$N$1, 0)), \"\")","v":0},{"$f":"IFERROR(INDEX(SUDAC_EKIPE!$C$2:$N$51, ROWS($A$1:A1), MATCH($E$4, SUDAC_EKIPE!$C$1:$N$1, 0)), \"\")","v":0},{"$f":"IFERROR(INDEX(SUDAC_EKIPE!$C$2:$N$51, ROWS($A$1:A1), MATCH($B$12, SUDAC_EKIPE!$C$1:$N$1, 0)), \"\")","v":0},{"$f":"IFERROR(INDEX(SUDAC_EKIPE!$C$2:$N$51, ROWS($A$1:A1), MATCH($E$12, SUDAC_EKIPE!$C$1:$N$1, 0)), \"\")","v":0}]
[null,"-",null,null,"-",null,null,null,null,"-",null,null,null,"1. 9. 2025.",null,null,null,null,null,null,null,null,null,null,null,null,null,null,null,null,null,null,null,{"$f":"SUDAC_EKIPE!$D$1","v":"BROVINJE 2"},{"$f":"IFERROR(INDEX(SUDAC_EKIPE!$C$2:$N$51, ROWS($A$1:A2), MATCH($B$4, SUDAC_EKIPE!$C$1:$N$1, 0)), \"\")","v":0},{"$f":"IFERROR(INDEX(SUDAC_EKIPE!$C$2:$N$51, ROWS($A$1:A2), MATCH($E$4, SUDAC_EKIPE!$C$1:$N$1, 0)), \"\")","v":0},{"$f":"IFERROR(INDEX(SUDAC_EKIPE!$C$2:$N$51, ROWS($A$1:A2), MATCH($B$12, SUDAC_EKIPE!$C$1:$N$1, 0)), \"\")","v":0},{"$f":"IFERROR(INDEX(SUDAC_EKIPE!$C$2:$N$51, ROWS($A$1:A2), MATCH($E$12, SUDAC_EKIPE!$C$1:$N$1, 0)), \"\")","v":0}]
["Domaćin",null,null,"Gost",null,null,null,null,null,null,null,null,null,"Gost",null,null,null,null,null,null,null,null,null,null,null,null,null,null,null,null,null,null,null,{"$f":"SUDAC_EKIPE!$E$1","v":"BUZET 1"},{"$f":"IFERROR(INDEX(SUDAC_EKIPE!$C$2:$N$51, ROWS($A$1:A3), MATCH($B$4, SUDAC_EKIPE!$C$1:$N$1, 0)), \"\")","v":0},{"$f":"IFERROR(INDEX(SUDAC_EKIPE!$C$2:$N$51, ROWS($A$1:A3), MATCH($E$4, SUDAC_EKIPE!$C$1:$N$1, 0)), \"\")","v":0},{"$f":"IFERROR(INDEX(SUDAC_EKIPE!$C$2:$N$51, ROWS($A$1:A3), MATCH($B$12, SUDAC_EKIPE!$C$1:$N$1, 0)), \"\")","v":0},{"$f":"IFERROR(INDEX(SUDAC_EKIPE!$C$2:$N$51, ROWS($A$1:A3), MATCH($E$12, SUDAC_EKIPE!$C$1:$N$1, 0)), \"\")","v":0}]
["A",null,null,"X",null,null,null,null,null,null,null,null,null,null,null,null,null,null,null,null,null,null,null,null,null,null,null,null,null,null,null,null,null,{"$f":"SUDAC_EKIPE!$F$1","v":"BUZET 2"},{"$f":"IFERROR(INDEX(SUDAC_EKIPE!$C$2:$N$51, ROWS($A$1:A4), MATCH($B$4, SUDAC_EKIPE!$C$1:$N$1, 0)), \"\")","v":0},{"$f":"IFERROR(INDEX(SUDAC_EKIPE!$C$2:$N$51, ROWS($A$1:A4), MATCH($E$4, SUDAC_EKIPE!$C$1:$N$1, 0)), \"\")","v":0},{"$f":"IFERROR(INDEX(SUDAC_EKIPE!$C$2:$N$51, ROWS($A$1:A4), MATCH($B$12, SUDAC_EKIPE!$C$1:$N$1, 0)), \"\")","v":0},{"$f":"IFERROR(INDEX(SUDAC_EKIPE!$C$2:$N$51, ROWS($A$1:A4), MATCH($E$12, SUDAC_EKIPE!$C$1:$N$1, 0)), \"\")","v":0}]
["B",null,null,"Y",null,null,null,null,null,null,null,null,null,null,null,null,null,null,null,null,null,null,null,null,null,null,null,null," ",null,null,null,null,{"$f":"SUDAC_EKIPE!$G$1","v":"MAESTRAL 2"},{"$f":"IFERROR(INDEX(SUDAC_EKIPE!$C$2:$N$51, ROWS($A$1:A5), MATCH($B$4, SUDAC_EKIPE!$C$1:$N$1, 0)), \"\")","v":0},{"$f":"IFERROR(INDEX(SUDAC_EKIPE!$C$2:$N$51, ROWS($A$1:A5), MATCH($E$4, SUDAC_EKIPE!$C$1:$N$1, 0)), \"\")","v":0},{"$f":"IFERROR(INDEX(SUDAC_EKIPE!$C$2:$N$51, ROWS($A$1:A5), MATCH($B$12, SUDAC_EKIPE!$C$1:$N$1, 0)), \"\")","v":0},{"$f":"IFERROR(INDEX(SUDAC_EKIPE!$C$2:$N$51, ROWS($A$1:A5), MATCH($E$12, SUDAC_EKIPE!$C$1:$N$1, 0)), \"\")","v":0}]
["C",null,null,"Z",null,null,null,null,null,null," ",null,null,null,null,null,null,null,null,null,null,null,null,null,null,null,null,null,null,null,null,null,null,{"$f":"SUDAC_EKIPE!$H$1","v":"PAZIN"},{"$f":"IFERROR(INDEX(SUDAC_EKIPE!$C$2:$N$51, ROWS($A$1:A6), MATCH($B$4, SUDAC_EKIPE!$C$1:$N$1, 0)), \"\")","v":0},{"$f":"IFERROR(INDEX(SUDAC_EKIPE!$C$2:$N$51, ROWS($A$1:A6), MATCH($E$4, SUDAC_EKIPE!$C$1:$N$1, 0)), \"\")","v":0},{"$f":"IFERROR(INDEX(SUDAC_EKIPE!$C$2:$N$51, ROWS($A$1:A6), MATCH($B$12, SUDAC_EKIPE!$C$1:$N$1, 0)), \"\")","v":0},{"$f":"IFERROR(INDEX(SUDAC_EKIPE!$C$2:$N$51, ROWS($A$1:A6), MATCH($E$12, SUDAC_EKIPE!$C$1:$N$1, 0)), \"\")","v":0}]
["R1",null,null,"R1",null,null,null,null,null,null,null,null,null,null,null,null,null,null,null,null,null,null,null,null,null,null,null,null,null,null,null,null,null,{"$f":"SUDAC_EKIPE!$I$1","v":"VAL SHARK"},{"$f":"IFERROR(INDEX(SUDAC_EKIPE!$C$2:$N$51, ROWS($A$1:A7), MATCH($B$4, SUDAC_EKIPE!$C$1:$N$1, 0)), \"\")","v":0},{"$f":"IFERROR(INDEX(SUDAC_EKIPE!$C$2:$N$51, ROWS($A$1:A7), MATCH($E$4, SUDAC_EKIPE!$C$1:$N$1, 0)), \"\")","v":0},{"$f":"IFERROR(INDEX(SUDAC_EKIPE!$C$2:$N$51, ROWS($A$1:A7), MATCH($B$12, SUDAC_EKIPE!$C$1:$N$1, 0)), \"\")","v":0},{"$f":"IFERROR(INDEX(SUDAC_EKIPE!$C$2:$N$51, ROWS($A$1:A7), MATCH($E$12, SUDAC_EKIPE!$C$1:$N$1, 0)), \"\")","v":0}]
["R2",null,null,"R2",null,null,null,null,null,null,null,null,null,null,null,null,null,null,null,null,null,null,null,null,null,null,null,null,null,null,null,null,null,{"$f":"SUDAC_EKIPE!$J$1","v":0},{"$f":"IFERROR(INDEX(SUDAC_EKIPE!$C$2:$N$51, ROWS($A$1:A8), MATCH($B$4, SUDAC_EKIPE!$C$1:$N$1, 0)), \"\")","v":0},{"$f":"IFERROR(INDEX(SUDAC_EKIPE!$C$2:$N$51, ROWS($A$1:A8), MATCH($E$4, SUDAC_EKIPE!$C$1:$N$1, 0)), \"\")","v":0},{"$f":"IFERROR(INDEX(SUDAC_EKIPE!$C$2:$N$51, ROWS($A$1:A8), MATCH($B$12, SUDAC_EKIPE!$C$1:$N$1, 0)), \"\")","v":0},{"$f":"IFERROR(INDEX(SUDAC_EKIPE!$C$2:$N$51, ROWS($A$1:A8), MATCH($E$12, SUDAC_EKIPE!$C$1:$N$1, 0)), \"\")","v":0}]
[null,null,null,null,null,null,null,null,null,null,null,null,null,null,null,null,null,null,null,null,null,null,null,null,null,null,null,null,null,null,null,null,null,{"$f":"SUDAC_EKIPE!$K$1","v":0},{"$f":"IFERROR(INDEX(SUDAC_EKIPE!$C$2:$N$51, ROWS($A$1:A9), MATCH($B$4, SUDAC_EKIPE!$C$1:$N$1, 0)), \"\")","v":0},{"$f":"IFERROR(INDEX(SUDAC_EKIPE!$C$2:$N$51, ROWS($A$1:A9), MATCH($E$4, SUDAC_EKIPE!$C$1:$N$1, 0)), \"\")","v":0},{"$f":"IFERROR(INDEX(SUDAC_EKIPE!$C$2:$N$51, ROWS($A$1:A9), MATCH($B$12, SUDAC_EKIPE!$C$1:$N$1, 0)), \"\")","v":0},{"$f":"IFERROR(INDEX(SUDAC_EKIPE!$C$2:$N$51, ROWS($A$1:A9), MATCH($E$12, SUDAC_EKIPE!$C$1:$N$1, 0)), \"\")","v":0}]
[null,"DOMAĆIN",null,null,"GOST",null,null,null," ",null,null,null,null,null,null,null,null,null,null,null,null,null,null,null,null,null,null,null," ",null,null,null,null,{"$f":"SUDAC_EKIPE!$L$1","v":0},{"$f":"IFERROR(INDEX(SUDAC_EKIPE!$C$2:$N$51, ROWS($A$1:A10), MATCH($B$4, SUDAC_EKIPE!$C$1:$N$1, 0)), \"\")","v":0},{"$f":"IFERROR(INDEX(SUDAC_EKIPE!$C$2:$N$51, ROWS($A$1:A10), MATCH($E$4, SUDAC_EKIPE!$C$1:$N$1, 0)), \"\")","v":0},{"$f":"IFERROR(INDEX(SUDAC_EKIPE!$C$2:$N$51, ROWS($A$1:A10), MATCH($B$12, SUDAC_EKIPE!$C$1:$N$1, 0)), \"\")","v":0},{"$f":"IFERROR(INDEX(SUDAC_EKIPE!$C$2:$N$51, ROWS($A$1:A10), MATCH($E$12, SUDAC_EKIPE!$C$1:$N$1, 0)), \"\")","v":0}]
[null,null,null,null,null,null,null,null,null,null,null,null,null,null,null,null,null,null,null,null,null,null,null,null,null,null,null,null,null,null,null,null,null,{"$f":"SUDAC_EKIPE!$M$1","v":0},{"$f":"IFERROR(INDEX(SUDAC_EKIPE!$C$2:$N$51, ROWS($A$1:A11), MATCH($B$4, SUDAC_EKIPE!$C$1:$N$1, 0)), \"\")","v":0},{"$f":"IFERROR(INDEX(SUDAC_EKIPE!$C$2:$N$51, ROWS($A$1:A11), MATCH($E$4, SUDAC_EKIPE!$C$1:$N$1, 0)), \"\")","v":0},{"$f":"IFERROR(INDEX(SUDAC_EKIPE!$C$2:$N$51, ROWS($A$1:A11), MATCH($B$12, SUDAC_EKIPE!$C$1:$N$1, 0)), \"\")","v":0},{"$f":"IFERROR(INDEX(SUDAC_EKIPE!$C$2:$N$51, ROWS($A$1:A11), MATCH($E$12, SUDAC_EKIPE!$C$1:$N$1, 0)), \"\")","v":0}]
[null,null,"A","X",null,null,":",null,null,":",null,null,":",null,null,":",null,null,":",null,null,{"$f":"IF(COUNTA(F13:T13)=0,\"\",_xlfn.LET(_xlpm.h,CHOOSE({1,2,3,4,5},F13,I13,L13,O13,R13),_xlpm.a,CHOOSE({1,2,3,4,5},H13,K13,N13,Q13,T13),SUM((_xlpm.h>_xlpm.a)*(_xlpm.h<>\"\")*(_xlpm.a<>\"\"))))","v":0},":",{"$f":"IF(COUNTA(F13:T13)=0,\"\",_xlfn.LET(_xlpm.h,CHOOSE({1,2,3,4,5},F13,I13,L13,O13,R13),_xlpm.a,CHOOSE({1,2,3,4,5},H13,K13,N13,Q13,T13),SUM((_xlpm.a>_xlpm.h)*(_xlpm.h<>\"\")*(_xlpm.a<>\"\"))))","v":0},{"$f":"IF(OR(V13=\"\",X13=\"\"),\"\",IF(MAX(V13,X13)<3,\"\",SUMPRODUCT(--($V$13:V13>$X$13:X13),--(($V$13:V13>=3)+($X$13:X13>=3)>0))))","v":""},":",{"$f":"IF(OR(V13=\"\",X13=\"\"),\"\",IF(MAX(V13,X13)<3,\"\",SUMPRODUCT(--($X$13:X13>$V$13:V13),--(($V$13:V13>=3)+($X$13:X13>=3)>0))))","v":""},null,null,null,null,null,null,{"$f":"SUDAC_EKIPE!$N$1","v":0},{"$f":"IFERROR(INDEX(SUDAC_EKIPE!$C$2:$N$51, ROWS($A$1:A12), MATCH($B$4, SUDAC_EKIPE!$C$1:$N$1, 0)), \"\")","v":0},{"$f":"IFERROR(INDEX(SUDAC_EKIPE!$C$2:$N$51, ROWS($A$1:A12), MATCH($E$4, SUDAC_EKIPE!$C$1:$N$1, 0)), \"\")","v":0},{"$f":"IFERROR(INDEX(SUDAC_EKIPE!$C$2:$N$51, ROWS($A$1:A12), MATCH($B$12, SUDAC_EKIPE!$C$1:$N$1, 0)), \"\")","v":0},{"$f":"IFERROR(INDEX(SUDAC_EKIPE!$C$2:$N$51, ROWS($A$1:A12), MATCH($E$12, SUDAC_EKIPE!$C$1:$N$1, 0)), \"\")","v":0}]
[null,null,"B","Y",null,null,":",null,null,":",null,null,":",null,null,":",null,null,":",null,null,{"$f":"IF(COUNTA(F14:T14)=0,\"\",_xlfn.LET(_xlpm.h,CHOOSE({1,2,3,4,5},F14,I14,L14,O14,R14),_xlpm.a,CHOOSE({1,2,3,4,5},H14,K14,N14,Q14,T14),SUM((_xlpm.h>_xlpm.a)*(_xlpm.h<>\"\")*(_xlpm.a<>\"\"))))","v":0},":",{"$f":"IF(COUNTA(F14:T14)=0,\"\",_xlfn.LET(_xlpm.h,CHOOSE({1,2,3,4,5},F14,I14,L14,O14,R14),_xlpm.a,CHOOSE({1,2,3,4,5},H14,K14,N14,Q14,T14),SUM((_xlpm.a>_xlpm.h)*(_xlpm.h<>\"\")*(_xlpm.a<>\"\"))))","v":0},{"$f":"IF(OR(V14=\"\",X14=\"\"),\"\",IF(MAX(V14,X14)<3,\"\",SUMPRODUCT(--($V$13:V14>$X$13:X14),--(($V$13:V14>=3)+($X$13:X14>=3)>0))))","v":""},":",{"$f":"IF(OR(V14=\"\",X14=\"\"),\"\",IF(MAX(V14,X14)<3,\"\",SUMPRODUCT(--($X$13:X14>$V$13:V14),--(($V$13:V14>=3)+($X$13:X14>=3)>0))))","v":""},null,null,null,null,null,null,null,{"$f":"IFERROR(INDEX(SUDAC_EKIPE!$C$2:$N$51, ROWS($A$1:A13), MATCH($B$4, SUDAC_EKIPE!$C$1:$N$1, 0)), \"\")","v":0},{"$f":"IFERROR(INDEX(SUDAC_EKIPE!$C$2:$N$51, ROWS($A$1:A13), MATCH($E$4, SUDAC_EKIPE!$C$1:$N$1, 0)), \"\")","v":0},{"$f":"IFERROR(INDEX(SUDAC_EKIPE!$C$2:$N$51, ROWS($A$1:A13), MATCH($B$12, SUDAC_EKIPE!$C$1:$N$1, 0)), \"\")","v":0},{"$f":"IFERROR(INDEX(SUDAC_EKIPE!$C$2:$N$51, ROWS($A$1:A13), MATCH($E$12, SUDAC_EKIPE!$C$1:$N$1, 0)), \"\")","v":0}]
[null,null,"C","Z",null,null,":",null,null,":",null,null,":",null,null,":",null,null,":",null,null,{"$f":"IF(COUNTA(F15:T15)=0,\"\",_xlfn.LET(_xlpm.h,CHOOSE({1,2,3,4,5},F15,I15,L15,O15,R15),_xlpm.a,CHOOSE({1,2,3,4,5},H15,K15,N15,Q15,T15),SUM((_xlpm.h>_xlpm.a)*(_xlpm.h<>\"\")*(_xlpm.a<>\"\"))))","v":0},":",{"$f":"IF(COUNTA(F15:T15)=0,\"\",_xlfn.LET(_xlpm.h,CHOOSE({1,2,3,4,5},F15,I15,L15,O15,R15),_xlpm.a,CHOOSE({1,2,3,4,5},H15,K15,N15,Q15,T15),SUM((_xlpm.a>_xlpm.h)*(_xlpm.h<>\"\")*(_xlpm.a<>\"\"))))","v":0},{"$f":"IF(OR(V15=\"\",X15=\"\"),\"\",IF(MAX(V15,X15)<3,\"\",SUMPRODUCT(--($V$13:V15>$X$13:X15),--(($V$13:V15>=3)+($X$13:X15>=3)>0))))","v":""},":",{"$f":"IF(OR(V15=\"\",X15=\"\"),\"\",IF(MAX(V15,X15)<3,\"\",SUMPRODUCT(--($X$13:X15>$V$13:V15),--(($V$13:V15>=3)+($X$13:X15>=3)>0))))","v":""},null,null,null,null,null,null,null,{"$f":"IFERROR(INDEX(SUDAC_EKIPE!$C$2:$N$51, ROWS($A$1:A14), MATCH($B$4, SUDAC_EKIPE!$C$1:$N$1, 0)), \"\")","v":0},{"$f":"IFERROR(INDEX(SUDAC_EKIPE!$C$2:$N$51, ROWS($A$1:A14), MATCH($E$4, SUDAC_EKIPE!$C$1:$N$1, 0)), \"\")","v":0},{"$f":"IFERROR(INDEX(SUDAC_EKIPE!$C$2:$N$51, ROWS($A$1:A14), MATCH($B$12, SUDAC_EKIPE!$C$1:$N$1, 0)), \"\")","v":0},{"$f":"IFERROR(INDEX(SUDAC_EKIPE!$C$2:$N$51, ROWS($A$1:A14), MATCH($E$12, SUDAC_EKIPE!$C$1:$N$1, 0)), \"\")","v":0}]
[null,null,"PAR","PAR",null,null,":",null,null,":",null,null,":",null,null,":",null,null,":",null,null,{"$f":"IF(COUNTA(F16:T16)=0,\"\",_xlfn.LET(_xlpm.h,CHOOSE({1,2,3,4,5},F16,I16,L16,O16,R16),_xlpm.a,CHOOSE({1,2,3,4,5},H16,K16,N16,Q16,T16),SUM((_xlpm.h>_xlpm.a)*(_xlpm.h<>\"\")*(_xlpm.a<>\"\"))))","v":0},":",{"$f":"IF(COUNTA(F16:T16)=0,\"\",_xlfn.LET(_xlpm.h,CHOOSE({1,2,3,4,5},F16,I16,L16,O16,R16),_xlpm.a,CHOOSE({1,2,3,4,5},H16,K16,N16,Q16,T16),SUM((_xlpm.a>_xlpm.h)*(_xlpm.h<>\"\")*(_xlpm.a<>\"\"))))","v":0},{"$f":"IF(OR(V16=\"\",X16=\"\"),\"\",IF(MAX(V16,X16)<3,\"\",SUMPRODUCT(--($V$13:V16>$X$13:X16),--(($V$13:V16>=3)+($X$13:X16>=3)>0))))","v":""},":",{"$f":"IF(OR(V16=\"\",X16=\"\"),\"\",IF(MAX(V16,X16)<3,\"\",SUMPRODUCT(--($X$13:X16>$V$13:V16),--(($V$13:V16>=3)+($X$13:X16>=3)>0))))","v":""},null,null,null,null,null,null,null,{"$f":"IFERROR(INDEX(SUDAC_EKIPE!$C$2:$N$51, ROWS($A$1:A15), MATCH($B$4, SUDAC_EKIPE!$C$1:$N$1, 0)), \"\")","v":0},{"$f":"IFERROR(INDEX(SUDAC_EKIPE!$C$2:$N$51, ROWS($A$1:A15), MATCH($E$4, SUDAC_EKIPE!$C$1:$N$1, 0)), \"\")","v":0},{"$f":"IFERROR(INDEX(SUDAC_EKIPE!$C$2:$N$51, ROWS($A$1:A15), MATCH($B$12, SUDAC_EKIPE!$C$1:$N$1, 0)), \"\")","v":0},{"$f":"IFERROR(INDEX(SUDAC_EKIPE!$C$2:$N$51, ROWS($A$1:A15), MATCH($E$12, SUDAC_EKIPE!$C$1:$N$1, 0)), \"\")","v":0}]
[null,null,"PAR","PAR",null,null,":",null,null,":",null,null,":",null,null,":",null,null,":",null,null,{"$f":"IF(COUNTA(F17:T17)=0,\"\",_xlfn.LET(_xlpm.h,CHOOSE({1,2,3,4,5},F17,I17,L17,O17,R17),_xlpm.a,CHOOSE({1,2,3,4,5},H17,K17,N17,Q17,T17),SUM((_xlpm.h>_xlpm.a)*(_xlpm.h<>\"\")*(_xlpm.a<>\"\"))))","v":0},":",{"$f":"IF(COUNTA(F17:T17)=0,\"\",_xlfn.LET(_xlpm.h,CHOOSE({1,2,3,4,5},F17,I17,L17,O17,R17),_xlpm.a,CHOOSE({1,2,3,4,5},H17,K17,N17,Q17,T17),SUM((_xlpm.a>_xlpm.h)*(_xlpm.h<>\"\")*(_xlpm.a<>\"\"))))","v":0},{"$f":"IF(OR(V17=\"\",X17=\"\"),\"\",IF(MAX(V17,X17)<3,\"\",SUMPRODUCT(--($V$13:V17>$X$13:X17),--(($V$13:V17>=3)+($X$13:X17>=3)>0))))","v":""},":",{"$f":"IF(OR(V17=\"\",X17=\"\"),\"\",IF(MAX(V17,X17)<3,\"\",SUMPRODUCT(--($X$13:X17>$V$13:V17),--(($V$13:V17>=3)+($X$13:X17>=3)>0))))","v":""},null,null,null,null,null,null,null,{"$f":"IFERROR(INDEX(SUDAC_EKIPE!$C$2:$N$51, ROWS($A$1:A16), MATCH($B$4, SUDAC_EKIPE!$C$1:$N$1, 0)), \"\")","v":0},{"$f":"IFERROR(INDEX(SUDAC_EKIPE!$C$2:$N$51, ROWS($A$1:A16), MATCH($E$4, SUDAC_EKIPE!$C$1:$N$1, 0)), \"\")","v":0},{"$f":"IFERROR(INDEX(SUDAC_EKIPE!$C$2:$N$51, ROWS($A$1:A16), MATCH($B$12, SUDAC_EKIPE!$C$1:$N$1, 0)), \"\")","v":0},{"$f":"IFERROR(INDEX(SUDAC_EKIPE!$C$2:$N$51, ROWS($A$1:A16), MATCH($E$12, SUDAC_EKIPE!$C$1:$N$1, 0)), \"\")","v":0}]
[null,null,"A","Y",null,null,":",null,null,":",null,null,":",null,null,":",null,null,":",null,null,{"$f":"IF(COUNTA(F18:T18)=0,\"\",_xlfn.LET(_xlpm.h,CHOOSE({1,2,3,4,5},F18,I18,L18,O18,R18),_xlpm.a,CHOOSE({1,2,3,4,5},H18,K18,N18,Q18,T18),SUM((_xlpm.h>_xlpm.a)*(_xlpm.h<>\"\")*(_xlpm.a<>\"\"))))","v":0},":",{"$f":"IF(COUNTA(F18:T18)=0,\"\",_xlfn.LET(_xlpm.h,CHOOSE({1,2,3,4,5},F18,I18,L18,O18,R18),_xlpm.a,CHOOSE({1,2,3,4,5},H18,K18,N18,Q18,T18),SUM((_xlpm.a>_xlpm.h)*(_xlpm.h<>\"\")*(_xlpm.a<>\"\"))))","v":0},{"$f":"IF(OR(V18=\"\",X18=\"\"),\"\",IF(MAX(V18,X18)<3,\"\",SUMPRODUCT(--($V$13:V18>$X$13:X18),--(($V$13:V18>=3)+($X$13:X18>=3)>0))))","v":""},":",{"$f":"IF(OR(V18=\"\",X18=\"\"),\"\",IF(MAX(V18,X18)<3,\"\",SUMPRODUCT(--($X$13:X18>$V$13:V18),--(($V$13:V18>=3)+($X$13:X18>=3)>0))))","v":""},null,null,null,null,null,null,null,{"$f":"IFERROR(INDEX(SUDAC_EKIPE!$C$2:$N$51, ROWS($A$1:A17), MATCH($B$4, SUDAC_EKIPE!$C$1:$N$1, 0)), \"\")","v":0},{"$f":"IFERROR(INDEX(SUDAC_EKIPE!$C$2:$N$51, ROWS($A$1:A17), MATCH($E$4, SUDAC_EKIPE!$C$1:$N$1, 0)), \"\")","v":0},{"$f":"IFERROR(INDEX(SUDAC_EKIPE!$C$2:$N$51, ROWS($A$1:A17), MATCH($B$12, SUDAC_EKIPE!$C$1:$N$1, 0)), \"\")","v":0},{"$f":"IFERROR(INDEX(SUDAC_EKIPE!$C$2:$N$51, ROWS($A$1:A17), MATCH($E$12, SUDAC_EKIPE!$C$1:$N$1, 0)), \"\")","v":0}]
[null,null,"C","X",null,null,":",null,null,":",null,null,":",null,null,":",null,null,":",null,null,{"$f":"IF(COUNTA(F19:T19)=0,\"\",_xlfn.LET(_xlpm.h,CHOOSE({1,2,3,4,5},F19,I19,L19,O19,R19),_xlpm.a,CHOOSE({1,2,3,4,5},H19,K19,N19,Q19,T19),SUM((_xlpm.h>_xlpm.a)*(_xlpm.h<>\"\")*(_xlpm.a<>\"\"))))","v":0},":",{"$f":"IF(COUNTA(F19:T19)=0,\"\",_xlfn.LET(_xlpm.h,CHOOSE({1,2,3,4,5},F19,I19,L19,O19,R19),_xlpm.a,CHOOSE({1,2,3,4,5},H19,K19,N19,Q19,T19),SUM((_xlpm.a>_xlpm.h)*(_xlpm.h<>\"\")*(_xlpm.a<>\"\"))))","v":0},{"$f":"IF(OR(V19=\"\",X19=\"\"),\"\",IF(MAX(V19,X19)<3,\"\",SUMPRODUCT(--($V$13:V19>$X$13:X19),--(($V$13:V19>=3)+($X$13:X19>=3)>0))))","v":""},":",{"$f":"IF(OR(V19=\"\",X19=\"\"),\"\",IF(MAX(V19,X19)<3,\"\",SUMPRODUCT(--($X$13:X19>$V$13:V19),--(($V$13:V19>=3)+($X$13:X19>=3)>0))))","v":""},null,null,null,null,null,null,null,{"$f":"IFERROR(INDEX(SUDAC_EKIPE!$C$2:$N$51, ROWS($A$1:A18), MATCH($B$4, SUDAC_EKIPE!$C$1:$N$1, 0)), \"\")","v":0},{"$f":"IFERROR(INDEX(SUDAC_EKIPE!$C$2:$N$51, ROWS($A$1:A18), MATCH($E$4, SUDAC_EKIPE!$C$1:$N$1, 0)), \"\")","v":0},{"$f":"IFERROR(INDEX(SUDAC_EKIPE!$C$2:$N$51, ROWS($A$1:A18), MATCH($B$12, SUDAC_EKIPE!$C$1:$N$1, 0)), \"\")","v":0},{"$f":"IFERROR(INDEX(SUDAC_EKIPE!$C$2:$N$51, ROWS($A$1:A18), MATCH($E$12, SUDAC_EKIPE!$C$1:$N$1, 0)), \"\")","v":0}]
[null,null,"B","Z",null,null,":",null,null,":",null,null,":",null,null,":",null,null,":",null,null,{"$f":"IF(COUNTA(F20:T20)=0,\"\",_xlfn.LET(_xlpm.h,CHOOSE({1,2,3,4,5},F20,I20,L20,O20,R20),_xlpm.a,CHOOSE({1,2,3,4,5},H20,K20,N20,Q20,T20),SUM((_xlpm.h>_xlpm.a)*(_xlpm.h<>\"\")*(_xlpm.a<>\"\"))))","v":0},":",{"$f":"IF(COUNTA(F20:T20)=0,\"\",_xlfn.LET(_xlpm.h,CHOOSE({1,2,3,4,5},F20,I20,L20,O20,R20),_xlpm.a,CHOOSE({1,2,3,4,5},H20,K20,N20,Q20,T20),SUM((_xlpm.a>_xlpm.h)*(_xlpm.h<>\"\")*(_xlpm.a<>\"\"))))","v":0},{"$f":"IF(OR(V20=\"\",X20=\"\"),\"\",IF(MAX(V20,X20)<3,\"\",SUMPRODUCT(--($V$13:V20>$X$13:X20),--(($V$13:V20>=3)+($X$13:X20>=3)>0))))","v":""},":",{"$f":"IF(OR(V20=\"\",X20=\"\"),\"\",IF(MAX(V20,X20)<3,\"\",SUMPRODUCT(--($X$13:X20>$V$13:V20),--(($V$13:V20>=3)+($X$13:X20>=3)>0))))","v":""},null,null,null,null,null,null,null,{"$f":"IFERROR(INDEX(SUDAC_EKIPE!$C$2:$N$51, ROWS($A$1:A19), MATCH($B$4, SUDAC_EKIPE!$C$1:$N$1, 0)), \"\")","v":0},{"$f":"IFERROR(INDEX(SUDAC_EKIPE!$C$2:$N$51, ROWS($A$1:A19), MATCH($E$4, SUDAC_EKIPE!$C$1:$N$1, 0)), \"\")","v":0},{"$f":"IFERROR(INDEX(SUDAC_EKIPE!$C$2:$N$51, ROWS($A$1:A19), MATCH($B$12, SUDAC_EKIPE!$C$1:$N$1, 0)), \"\")","v":0},{"$f":"IFERROR(INDEX(SUDAC_EKIPE!$C$2:$N$51, ROWS($A$1:A19), MATCH($E$12, SUDAC_EKIPE!$C$1:$N$1, 0)), \"\")","v":0}]
[null,null,null,null,null,null,null,null,null,null,null,null,null,null,null,null,null,null,null,null,null,null,null,null,null,null,null,null,null,null,null,null,null,null,{"$f":"IFERROR(INDEX(SUDAC_EKIPE!$C$2:$N$51, ROWS($A$1:A20), MATCH($B$4, SUDAC_EKIPE!$C$1:$N$1, 0)), \"\")","v":0},{"$f":"IFERROR(INDEX(SUDAC_EKIPE!$C$2:$N$51, ROWS($A$1:A20), MATCH($E$4, SUDAC_EKIPE!$C$1:$N$1, 0)), \"\")","v":0},{"$f":"IFERROR(INDEX(SUDAC_EKIPE!$C$2:$N$51, ROWS($A$1:A20), MATCH($B$12, SUDAC_EKIPE!$C$1:$N$1, 0)), \"\")","v":0},{"$f":"IFERROR(INDEX(SUDAC_EKIPE!$C$2:$N$51, ROWS($A$1:A20), MATCH($E$12, SUDAC_EKIPE!$C$1:$N$1, 0)), \"\")","v":0}]
[null,{"$f":"B4","v":0},":",null,{"$f":"E4","v":0},{"$f":"MAX(Y13:Y20)","v":0},":",{"$f":"MAX(AA13:AA20)","v":0},null,null,null,null,null,null,null,null,null,null,null,null,null,null,null,null,null,null,null,null,null,null,null,null,null,null,{"$f":"IFERROR(INDEX(SUDAC_EKIPE!$C$2:$N$51, ROWS($A$1:A21), MATCH($B$4, SUDAC_EKIPE!$C$1:$N$1, 0)), \"\")","v":0},{"$f":"IFERROR(INDEX(SUDAC_EKIPE!$C$2:$N$51, ROWS($A$1:A21), MATCH($E$4, SUDAC_EKIPE!$C$1:$N$1, 0)), \"\")","v":0},{"$f":"IFERROR(INDEX(SUDAC_EKIPE!$C$2:$N$51, ROWS($A$1:A21), MATCH($B$12, SUDAC_EKIPE!$C$1:$N$1, 0)), \"\")","v":0},{"$f":"IFERROR(INDEX(SUDAC_EKIPE!$C$2:$N$51, ROWS($A$1:A21), MATCH($E$12, SUDAC_EKIPE!$C$1:$N$1, 0)), \"\")","v":0}]
[null,null,null,null,"SETOVI",{"$f":"SUM(V13:V20)","v":0},":",{"$f":"SUM(X13:X20)","v":0},null,null,null,null,null,null,null,null,null,null,null,null,null,null,null,null,null,null,null,null,null,null,null,null,null,null,{"$f":"IFERROR(INDEX(SUDAC_EKIPE!$C$2:$N$51, ROWS($A$1:A22), MATCH($B$4, SUDAC_EKIPE!$C$1:$N$1, 0)), \"\")","v":0},{"$f":"IFERROR(INDEX(SUDAC_EKIPE!$C$2:$N$51, ROWS($A$1:A22), MATCH($E$4, SUDAC_EKIPE!$C$1:$N$1, 0)), \"\")","v":0},{"$f":"IFERROR(INDEX(SUDAC_EKIPE!$C$2:$N$51, ROWS($A$1:A22), MATCH($B$12, SUDAC_EKIPE!$C$1:$N$1, 0)), \"\")","v":0},{"$f":"IFERROR(INDEX(SUDAC_EKIPE!$C$2:$N$51, ROWS($A$1:A22), MATCH($E$12, SUDAC_EKIPE!$C$1:$N$1, 0)), \"\")","v":0}]
[null,null,null,null,"POENI",{"$f":"SUM(F13:F20, I13:I20, L13:L20, O13:O20, R13:R20)","v":0},":",{"$f":"SUM(H13:H20, K13:K20, N13:N20, Q13:Q20, T13:T20)","v":0},null,null,null,null,null,null,null,null,null,null,null,null,null,null,null,null,null,null,null,null,null,null,null,null,null,null,{"$f":"IFERROR(INDEX(SUDAC_EKIPE!$C$2:$N$51, ROWS($A$1:A23), MATCH($B$4, SUDAC_EKIPE!$C$1:$N$1, 0)), \"\")","v":0},{"$f":"IFERROR(INDEX(SUDAC_EKIPE!$C$2:$N$51, ROWS($A$1:A23), MATCH($E$4, SUDAC_EKIPE!$C$1:$N$1, 0)), \"\")","v":0},{"$f":"IFERROR(INDEX(SUDAC_EKIPE!$C$2:$N$51, ROWS($A$1:A23), MATCH($B$12, SUDAC_EKIPE!$C$1:$N$1, 0)), \"\")","v":0},{"$f":"IFERROR(INDEX(SUDAC_EKIPE!$C$2:$N$51, ROWS($A$1:A23), MATCH($E$12, SUDAC_EKIPE!$C$1:$N$1, 0)), \"\")","v":0}]
[null,null,null,null,null,null,null,null,null,null,null,null,null,null,null,null,null,null,null,null,null,null,null,null,null,null,null,null,null,null,null,null,null,null,{"$f":"IFERROR(INDEX(SUDAC_EKIPE!$C$2:$N$51, ROWS($A$1:A24), MATCH($B$4, SUDAC_EKIPE!$C$1:$N$1, 0)), \"\")","v":0},{"$f":"IFERROR(INDEX(SUDAC_EKIPE!$C$2:$N$51, ROWS($A$1:A24), MATCH($E$4, SUDAC_EKIPE!$C$1:$N$1, 0)), \"\")","v":0},{"$f":"IFERROR(INDEX(SUDAC_EKIPE!$C$2:$N$51, ROWS($A$1:A24), MATCH($B$12, SUDAC_EKIPE!$C$1:$N$1, 0)), \"\")","v":0},{"$f":"IFERROR(INDEX(SUDAC_EKIPE!$C$2:$N$51, ROWS($A$1:A24), MATCH($E$12, SUDAC_EKIPE!$C$1:$N$1, 0)), \"\")","v":0}]
[null,null,null,null,null,null,null,null,null,null,null,null,null,null,null,null,null,null,null,null,null,null,null,null,null,null,null,null,null,null,null,null,null,null,{"$f":"IFERROR(INDEX(SUDAC_EKIPE!$C$2:$N$51, ROWS($A$1:A25), MATCH($B$4, SUDAC_EKIPE!$C$1:$N$1, 0)), \"\")","v":0},{"$f":"IFERROR(INDEX(SUDAC_EKIPE!$C$2:$N$51, ROWS($A$1:A25), MATCH($E$4, SUDAC_EKIPE!$C$1:$N$1, 0)), \"\")","v":0},{"$f":"IFERROR(INDEX(SUDAC_EKIPE!$C$2:$N$51, ROWS($A$1:A25), MATCH($B$12, SUDAC_EKIPE!$C$1:$N$1, 0)), \"\")","v":0},{"$f":"IFERROR(INDEX(SUDAC_EKIPE!$C$2:$N$51, ROWS($A$1:A25), MATCH($E$12, SUDAC_EKIPE!$C$1:$N$1, 0)), \"\")","v":0}]
[null,null,null,null,null,null,null,null,null,null,null,null,null,null,null,null,null,null,null,null,null,null,null,null,null,null,null,null,null,null,null,null,null,null,{"$f":"IFERROR(INDEX(SUDAC_EKIPE!$C$2:$N$51, ROWS($A$1:A26), MATCH($B$4, SUDAC_EKIPE!$C$1:$N$1, 0)), \"\")","v":0},{"$f":"IFERROR(INDEX(SUDAC_EKIPE!$C$2:$N$51, ROWS($A$1:A26), MATCH($E$4, SUDAC_EKIPE!$C$1:$N$1, 0)), \"\")","v":0},{"$f":"IFERROR(INDEX(SUDAC_EKIPE!$C$2:$N$51, ROWS($A$1:A26), MATCH($B$12, SUDAC_EKIPE!$C$1:$N$1, 0)), \"\")","v":0},{"$f":"IFERROR(INDEX(SUDAC_EKIPE!$C$2:$N$51, ROWS($A$1:A26), MATCH($E$12, SUDAC_EKIPE!$C$1:$N$1, 0)), \"\")","v":0}]
[null,null,null,null,null,null,null,null,null,null,null,null,null,null,null,null,null,null,null,null,null,null,null,null,null,null,null,null,null,null,null,null,null,null,{"$f":"IFERROR(INDEX(SUDAC_EKIPE!$C$2:$N$51, ROWS($A$1:A27), MATCH($B$4, SUDAC_EKIPE!$C$1:$N$1, 0)), \"\")","v":0},{"$f":"IFERROR(INDEX(SUDAC_EKIPE!$C$2:$N$51, ROWS($A$1:A27), MATCH($E$4, SUDAC_EKIPE!$C$1:$N$1, 0)), \"\")","v":0},{"$f":"IFERROR(INDEX(SUDAC_EKIPE!$C$2:$N$51, ROWS($A$1:A27), MATCH($B$12, SUDAC_EKIPE!$C$1:$N$1, 0)), \"\")","v":0},{"$f":"IFERROR(INDEX(SUDAC_EKIPE!$C$2:$N$51, ROWS($A$1:A27), MATCH($E$12, SUDAC_EKIPE!$C$1:$N$1, 0)), \"\")","v":0}]
[null,null,null,null,null,null,null,null,null,null,null,null,null,null,null,null,null,null,null,null,null,null,null,null,null,null,null,null,null,null,null,null,null,null,{"$f":"IFERROR(INDEX(SUDAC_EKIPE!$C$2:$N$51, ROWS($A$1:A28), MATCH($B$4, SUDAC_EKIPE!$C$1:$N$1, 0)), \"\")","v":0},{"$f":"IFERROR(INDEX(SUDAC_EKIPE!$C$2:$N$51, ROWS($A$1:A28), MATCH($E$4, SUDAC_EKIPE!$C$1:$N$1, 0)), \"\")","v":0},{"$f":"IFERROR(INDEX(SUDAC_EKIPE!$C$2:$N$51, ROWS($A$1:A28), MATCH($B$12, SUDAC_EKIPE!$C$1:$N$1, 0)), \"\")","v":0},{"$f":"IFERROR(INDEX(SUDAC_EKIPE!$C$2:$N$51, ROWS($A$1:A28), MATCH($E$12, SUDAC_EKIPE!$C$1:$N$1, 0)), \"\")","v":0}]
[null,null,null,null,null,null,null,null,null,null,null,null,null,null,null,null,null,null,null,null,null,null,null,null,null,null,null,null,null,null,null,null,null,null,{"$f":"IFERROR(INDEX(SUDAC_EKIPE!$C$2:$N$51, ROWS($A$1:A29), MATCH($B$4, SUDAC_EKIPE!$C$1:$N$1, 0)), \"\")","v":0},{"$f":"IFERROR(INDEX(SUDAC_EKIPE!$C$2:$N$51, ROWS($A$1:A29), MATCH($E$4, SUDAC_EKIPE!$C$1:$N$1, 0)), \"\")","v":0},{"$f":"IFERROR(INDEX(SUDAC_EKIPE!$C$2:$N$51, ROWS($A$1:A29), MATCH($B$12, SUDAC_EKIPE!$C$1:$N$1, 0)), \"\")","v":0},{"$f":"IFERROR(INDEX(SUDAC_EKIPE!$C$2:$N$51, ROWS($A$1:A29), MATCH($E$12, SUDAC_EKIPE!$C$1:$N$1, 0)), \"\")","v":0}]
[null,null,null,null,null,null,null,null,null,null,null,null,null,null,null,null,null,null,null,null,null,null,null,null,null,null,null,null,null,null,null,null,null,null,{"$f":"IFERROR(INDEX(SUDAC_EKIPE!$C$2:$N$51, ROWS($A$1:A30), MATCH($B$4, SUDAC_EKIPE!$C$1:$N$1, 0)), \"\")","v":0},{"$f":"IFERROR(INDEX(SUDAC_EKIPE!$C$2:$N$51, ROWS($A$1:A30), MATCH($E$4, SUDAC_EKIPE!$C$1:$N$1, 0)), \"\")","v":0},{"$f":"IFERROR(INDEX(SUDAC_EKIPE!$C$2:$N$51, ROWS($A$1:A30), MATCH($B$12, SUDAC_EKIPE!$C$1:$N$1, 0)), \"\")","v":0},{"$f":"IFERROR(INDEX(SUDAC_EKIPE!$C$2:$N$51, ROWS($A$1:A30), MATCH($E$12, SUDAC_EKIPE!$C$1:$N$1, 0)), \"\")","v":0}]
[null,null,null,null,null,null,null,null,null,null,null,null,null,null,null,null,null,null,null,null,null,null,null,null,null,null,null,null,null,null,null,null,null,null,{"$f":"IFERROR(INDEX(SUDAC_EKIPE!$C$2:$N$51, ROWS($A$1:A31), MATCH($B$4, SUDAC_EKIPE!$C$1:$N$1, 0)), \"\")","v":0},{"$f":"IFERROR(INDEX(SUDAC_EKIPE!$C$2:$N$51, ROWS($A$1:A31), MATCH($E$4, SUDAC_EKIPE!$C$1:$N$1, 0)), \"\")","v":0},{"$f":"IFERROR(INDEX(SUDAC_EKIPE!$C$2:$N$51, ROWS($A$1:A31), MATCH($B$12, SUDAC_EKIPE!$C$1:$N$1, 0)), \"\")","v":0},{"$f":"IFERROR(INDEX(SUDAC_EKIPE!$C$2:$N$51, ROWS($A$1:A31), MATCH($E$12, SUDAC_EKIPE!$C$1:$N$1, 0)), \"\")","v":0}]
[null,null,null,null,null,null,null,null,null,null,null,null,null,null,null,null,null,null,null,null,null,null,null,null,null,null,null,null,null,null,null,null,null,null,{"$f":"IFERROR(INDEX(SUDAC_EKIPE!$C$2:$N$51, ROWS($A$1:A32), MATCH($B$4, SUDAC_EKIPE!$C$1:$N$1, 0)), \"\")","v":0},{"$f":"IFERROR(INDEX(SUDAC_EKIPE!$C$2:$N$51, ROWS($A$1:A32), MATCH($E$4, SUDAC_EKIPE!$C$1:$N$1, 0)), \"\")","v":0},{"$f":"IFERROR(INDEX(SUDAC_EKIPE!$C$2:$N$51, ROWS($A$1:A32), MATCH($B$12, SUDAC_EKIPE!$C$1:$N$1, 0)), \"\")","v":0},{"$f":"IFERROR(INDEX(SUDAC_EKIPE!$C$2:$N$51, ROWS($A$1:A32), MATCH($E$12, SUDAC_EKIPE!$C$1:$N$1, 0)), \"\")","v":0}]
[null,null,null,null,null,null,null,null,null,null,null,null,null,null,null,null,null,null,null,null,null,null,null,null,null,null,null,null,null,null,null,null,null,null,{"$f":"IFERROR(INDEX(SUDAC_EKIPE!$C$2:$N$51, ROWS($A$1:A33), MATCH($B$4, SUDAC_EKIPE!$C$1:$N$1, 0)), \"\")","v":0},{"$f":"IFERROR(INDEX(SUDAC_EKIPE!$C$2:$N$51, ROWS($A$1:A33), MATCH($E$4, SUDAC_EKIPE!$C$1:$N$1, 0)), \"\")","v":0},{"$f":"IFERROR(INDEX(SUDAC_EKIPE!$C$2:$N$51, ROWS($A$1:A33), MATCH($B$12, SUDAC_EKIPE!$C$1:$N$1, 0)), \"\")","v":0},{"$f":"IFERROR(INDEX(SUDAC_EKIPE!$C$2:$N$51, ROWS($A$1:A33), MATCH($E$12, SUDAC_EKIPE!$C$1:$N$1, 0)), \"\")","v":0}]
[null,null,null,null,null,null,null,null,null,null,null,null,null,null,null,null,null,null,null,null,null,null,null,null,null,null,null,null,null,null,null,null,null,null,{"$f":"IFERROR(INDEX(SUDAC_EKIPE!$C$2:$N$51, ROWS($A$1:A34), MATCH($B$4, SUDAC_EKIPE!$C$1:$N$1, 0)), \"\")","v":0},{"$f":"IFERROR(INDEX(SUDAC_EKIPE!$C$2:$N$51, ROWS($A$1:A34), MATCH($E$4, SUDAC_EKIPE!$C$1:$N$1, 0)), \"\")","v":0},{"$f":"IFERROR(INDEX(SUDAC_EKIPE!$C$2:$N$51, ROWS($A$1:A34), MATCH($B$12, SUDAC_EKIPE!$C$1:$N$1, 0)), \"\")","v":0},{"$f":"IFERROR(INDEX(SUDAC_EKIPE!$C$2:$N$51, ROWS($A$1:A34), MATCH($E$12, SUDAC_EKIPE!$C$1:$N$1, 0)), \"\")","v":0}]
[null,null,null,null,null,null,null,null,null,null,null,null,null,null,null,null,null,null,null,null,null,null,null,null,null,null,null,null,null,null,null,null,null,null,{"$f":"IFERROR(INDEX(SUDAC_EKIPE!$C$2:$N$51, ROWS($A$1:A35), MATCH($B$4, SUDAC_EKIPE!$C$1:$N$1, 0)), \"\")","v":0},{"$f":"IFERROR(INDEX(SUDAC_EKIPE!$C$2:$N$51, ROWS($A$1:A35), MATCH($E$4, SUDAC_EKIPE!$C$1:$N$1, 0)), \"\")","v":0},{"$f":"IFERROR(INDEX(SUDAC_EKIPE!$C$2:$N$51, ROWS($A$1:A35), MATCH($B$12, SUDAC_EKIPE!$C$1:$N$1, 0)), \"\")","v":0},{"$f":"IFERROR(INDEX(SUDAC_EKIPE!$C$2:$N$51, ROWS($A$1:A35), MATCH($E$12, SUDAC_EKIPE!$C$1:$N$1, 0)), \"\")","v":0}]
[null,null,null,null,null,null,null,null,null,null,null,null,null,null,null,null,null,null,null,null,null,null,null,null,null,null,null,null,null,null,null,null,null,null,{"$f":"IFERROR(INDEX(SUDAC_EKIPE!$C$2:$N$51, ROWS($A$1:A36), MATCH($B$4, SUDAC_EKIPE!$C$1:$N$1, 0)), \"\")","v":0},{"$f":"IFERROR(INDEX(SUDAC_EKIPE!$C$2:$N$51, ROWS($A$1:A36), MATCH($E$4, SUDAC_EKIPE!$C$1:$N$1, 0)), \"\")","v":0},{"$f":"IFERROR(INDEX(SUDAC_EKIPE!$C$2:$N$51, ROWS($A$1:A36), MATCH($B$12, SUDAC_EKIPE!$C$1:$N$1, 0)), \"\")","v":0},{"$f":"IFERROR(INDEX(SUDAC_EKIPE!$C$2:$N$51, ROWS($A$1:A36), MATCH($E$12, SUDAC_EKIPE!$C$1:$N$1, 0)), \"\")","v":0}]
[null,null,null,null,null,null,null,null,null,null,null,null,null,null,null,null,null,null,null,null,null,null,null,null,null,null,null,null,null,null,null,null,null,null,{"$f":"IFERROR(INDEX(SUDAC_EKIPE!$C$2:$N$51, ROWS($A$1:A37), MATCH($B$4, SUDAC_EKIPE!$C$1:$N$1, 0)), \"\")","v":0},{"$f":"IFERROR(INDEX(SUDAC_EKIPE!$C$2:$N$51, ROWS($A$1:A37), MATCH($E$4, SUDAC_EKIPE!$C$1:$N$1, 0)), \"\")","v":0},{"$f":"IFERROR(INDEX(SUDAC_EKIPE!$C$2:$N$51, ROWS($A$1:A37), MATCH($B$12, SUDAC_EKIPE!$C$1:$N$1, 0)), \"\")","v":0},{"$f":"IFERROR(INDEX(SUDAC_EKIPE!$C$2:$N$51, ROWS($A$1:A37), MATCH($E$12, SUDAC_EKIPE!$C$1:$N$1, 0)), \"\")","v":0}]
[null,null,null,null,null,null,null,null,null,null,null,null,null,null,null,null,null,null,null,null,null,null,null,null,null,null,null,null,null,null,null,null,null,null,{"$f":"IFERROR(INDEX(SUDAC_EKIPE!$C$2:$N$51, ROWS($A$1:A38), MATCH($B$4, SUDAC_EKIPE!$C$1:$N$1, 0)), \"\")","v":0},{"$f":"IFERROR(INDEX(SUDAC_EKIPE!$C$2:$N$51, ROWS($A$1:A38), MATCH($E$4, SUDAC_EKIPE!$C$1:$N$1, 0)), \"\")","v":0},{"$f":"IFERROR(INDEX(SUDAC_EKIPE!$C$2:$N$51, ROWS($A$1:A38), MATCH($B$12, SUDAC_EKIPE!$C$1:$N$1, 0)), \"\")","v":0},{"$f":"IFERROR(INDEX(SUDAC_EKIPE!$C$2:$N$51, ROWS($A$1:A38), MATCH($E$12, SUDAC_EKIPE!$C$1:$N$1, 0)), \"\")","v":0}]
[null,null,null,null,null,null,null,null,null,null,null,null,null,null,null,null,null,null,null,null,null,null,null,null,null,null,null,null,null,null,null,null,null,null,{"$f":"IFERROR(INDEX(SUDAC_EKIPE!$C$2:$N$51, ROWS($A$1:A39), MATCH($B$4, SUDAC_EKIPE!$C$1:$N$1, 0)), \"\")","v":0},{"$f":"IFERROR(INDEX(SUDAC_EKIPE!$C$2:$N$51, ROWS($A$1:A39), MATCH($E$4, SUDAC_EKIPE!$C$1:$N$1, 0)), \"\")","v":0},{"$f":"IFERROR(INDEX(SUDAC_EKIPE!$C$2:$N$51, ROWS($A$1:A39), MATCH($B$12, SUDAC_EKIPE!$C$1:$N$1, 0)), \"\")","v":0},{"$f":"IFERROR(INDEX(SUDAC_EKIPE!$C$2:$N$51, ROWS($A$1:A39), MATCH($E$12, SUDAC_EKIPE!$C$1:$N$1, 0)), \"\")","v":0}]
[null,null,null,null,null,null,null,null,null,null,null,null,null,null,null,null,null,null,null,null,null,null,null,null,null,null,null,null,null,null,null,null,null,null,{"$f":"IFERROR(INDEX(SUDAC_EKIPE!$C$2:$N$51, ROWS($A$1:A40), MATCH($B$4, SUDAC_EKIPE!$C$1:$N$1, 0)), \"\")","v":0},{"$f":"IFERROR(INDEX(SUDAC_EKIPE!$C$2:$N$51, ROWS($A$1:A40), MATCH($E$4, SUDAC_EKIPE!$C$1:$N$1, 0)), \"\")","v":0},{"$f":"IFERROR(INDEX(SUDAC_EKIPE!$C$2:$N$51, ROWS($A$1:A40), MATCH($B$12, SUDAC_EKIPE!$C$1:$N$1, 0)), \"\")","v":0},{"$f":"IFERROR(INDEX(SUDAC_EKIPE!$C$2:$N$51, ROWS($A$1:A40), MATCH($E$12, SUDAC_EKIPE!$C$1:$N$1, 0)), \"\")","v":0}]
[null,null,null,null,null,null,null,null,null,null,null,null,null,null,null,null,null,null,null,null,null,null,null,null,null,null,null,null,null,null,null,null,null,null,{"$f":"IFERROR(INDEX(SUDAC_EKIPE!$C$2:$N$51, ROWS($A$1:A41), MATCH($B$4, SUDAC_EKIPE!$C$1:$N$1, 0)), \"\")","v":0},{"$f":"IFERROR(INDEX(SUDAC_EKIPE!$C$2:$N$51, ROWS($A$1:A41), MATCH($E$4, SUDAC_EKIPE!$C$1:$N$1, 0)), \"\")","v":0},{"$f":"IFERROR(INDEX(SUDAC_EKIPE!$C$2:$N$51, ROWS($A$1:A41), MATCH($B$12, SUDAC_EKIPE!$C$1:$N$1, 0)), \"\")","v":0},{"$f":"IFERROR(INDEX(SUDAC_EKIPE!$C$2:$N$51, ROWS($A$1:A41), MATCH($E$12, SUDAC_EKIPE!$C$1:$N$1, 0)), \"\")","v":0}]
[null,null,null,null,null,null,null,null,null,null,null,null,null,null,null,null,null,null,null,null,null,null,null,null,null,null,null,null,null,null,null,null,null,null,{"$f":"IFERROR(INDEX(SUDAC_EKIPE!$C$2:$N$51, ROWS($A$1:A42), MATCH($B$4, SUDAC_EKIPE!$C$1:$N$1, 0)), \"\")","v":0},{"$f":"IFERROR(INDEX(SUDAC_EKIPE!$C$2:$N$51, ROWS($A$1:A42), MATCH($E$4, SUDAC_EKIPE!$C$1:$N$1, 0)), \"\")","v":0},{"$f":"IFERROR(INDEX(SUDAC_EKIPE!$C$2:$N$51, ROWS($A$1:A42), MATCH($B$12, SUDAC_EKIPE!$C$1:$N$1, 0)), \"\")","v":0},{"$f":"IFERROR(INDEX(SUDAC_EKIPE!$C$2:$N$51, ROWS($A$1:A42), MATCH($E$12, SUDAC_EKIPE!$C$1:$N$1, 0)), \"\")","v":0}]
[null,null,null,null,null,null,null,null,null,null,null,null,null,null,null,null,null,null,null,null,null,null,null,null,null,null,null,null,null,null,null,null,null,null,{"$f":"IFERROR(INDEX(SUDAC_EKIPE!$C$2:$N$51, ROWS($A$1:A43), MATCH($B$4, SUDAC_EKIPE!$C$1:$N$1, 0)), \"\")","v":0},{"$f":"IFERROR(INDEX(SUDAC_EKIPE!$C$2:$N$51, ROWS($A$1:A43), MATCH($E$4, SUDAC_EKIPE!$C$1:$N$1, 0)), \"\")","v":0},{"$f":"IFERROR(INDEX(SUDAC_EKIPE!$C$2:$N$51, ROWS($A$1:A43), MATCH($B$12, SUDAC_EKIPE!$C$1:$N$1, 0)), \"\")","v":0},{"$f":"IFERROR(INDEX(SUDAC_EKIPE!$C$2:$N$51, ROWS($A$1:A43), MATCH($E$12, SUDAC_EKIPE!$C$1:$N$1, 0)), \"\")","v":0}]
[null,null,null,null,null,null,null,null,null,null,null,null,null,null,null,null,null,null,null,null,null,null,null,null,null,null,null,null,null,null,null,null,null,null,{"$f":"IFERROR(INDEX(SUDAC_EKIPE!$C$2:$N$51, ROWS($A$1:A44), MATCH($B$4, SUDAC_EKIPE!$C$1:$N$1, 0)), \"\")","v":0},{"$f":"IFERROR(INDEX(SUDAC_EKIPE!$C$2:$N$51, ROWS($A$1:A44), MATCH($E$4, SUDAC_EKIPE!$C$1:$N$1, 0)), \"\")","v":0},{"$f":"IFERROR(INDEX(SUDAC_EKIPE!$C$2:$N$51, ROWS($A$1:A44), MATCH($B$12, SUDAC_EKIPE!$C$1:$N$1, 0)), \"\")","v":0},{"$f":"IFERROR(INDEX(SUDAC_EKIPE!$C$2:$N$51, ROWS($A$1:A44), MATCH($E$12, SUDAC_EKIPE!$C$1:$N$1, 0)), \"\")","v":0}]
[null,null,null,null,null,null,null,null,null,null,null,null,null,null,null,null,null,null,null,null,null,null,null,null,null,null,null,null,null,null,null,null,null,null,{"$f":"IFERROR(INDEX(SUDAC_EKIPE!$C$2:$N$51, ROWS($A$1:A45), MATCH($B$4, SUDAC_EKIPE!$C$1:$N$1, 0)), \"\")","v":0},{"$f":"IFERROR(INDEX(SUDAC_EKIPE!$C$2:$N$51, ROWS($A$1:A45), MATCH($E$4, SUDAC_EKIPE!$C$1:$N$1, 0)), \"\")","v":0},{"$f":"IFERROR(INDEX(SUDAC_EKIPE!$C$2:$N$51, ROWS($A$1:A45), MATCH($B$12, SUDAC_EKIPE!$C$1:$N$1, 0)), \"\")","v":0},{"$f":"IFERROR(INDEX(SUDAC_EKIPE!$C$2:$N$51, ROWS($A$1:A45), MATCH($E$12, SUDAC_EKIPE!$C$1:$N$1, 0)), \"\")","v":0}]
[null,null,null,null,null,null,null,null,null,null,null,null,null,null,null,null,null,null,null,null,null,null,null,null,null,null,null,null,null,null,null,null,null,null,{"$f":"IFERROR(INDEX(SUDAC_EKIPE!$C$2:$N$51, ROWS($A$1:A46), MATCH($B$4, SUDAC_EKIPE!$C$1:$N$1, 0)), \"\")","v":0},{"$f":"IFERROR(INDEX(SUDAC_EKIPE!$C$2:$N$51, ROWS($A$1:A46), MATCH($E$4, SUDAC_EKIPE!$C$1:$N$1, 0)), \"\")","v":0},{"$f":"IFERROR(INDEX(SUDAC_EKIPE!$C$2:$N$51, ROWS($A$1:A46), MATCH($B$12, SUDAC_EKIPE!$C$1:$N$1, 0)), \"\")","v":0},{"$f":"IFERROR(INDEX(SUDAC_EKIPE!$C$2:$N$51, ROWS($A$1:A46), MATCH($E$12, SUDAC_EKIPE!$C$1:$N$1, 0)), \"\")","v":0}]
[null,null,null,null,null,null,null,null,null,null,null,null,null,null,null,null,null,null,null,null,null,null,null,null,null,null,null,null,null,null,null,null,null,null,{"$f":"IFERROR(INDEX(SUDAC_EKIPE!$C$2:$N$51, ROWS($A$1:A47), MATCH($B$4, SUDAC_EKIPE!$C$1:$N$1, 0)), \"\")","v":0},{"$f":"IFERROR(INDEX(SUDAC_EKIPE!$C$2:$N$51, ROWS($A$1:A47), MATCH($E$4, SUDAC_EKIPE!$C$1:$N$1, 0)), \"\")","v":0},{"$f":"IFERROR(INDEX(SUDAC_EKIPE!$C$2:$N$51, ROWS($A$1:A47), MATCH($B$12, SUDAC_EKIPE!$C$1:$N$1, 0)), \"\")","v":0},{"$f":"IFERROR(INDEX(SUDAC_EKIPE!$C$2:$N$51, ROWS($A$1:A47), MATCH($E$12, SUDAC_EKIPE!$C$1:$N$1, 0)), \"\")","v":0}]
[null,null,null,null,null,null,null,null,null,null,null,null,null,null,null,null,null,null,null,null,null,null,null,null,null,null,null,null,null,null,null,null,null,null,{"$f":"IFERROR(INDEX(SUDAC_EKIPE!$C$2:$N$51, ROWS($A$1:A48), MATCH($B$4, SUDAC_EKIPE!$C$1:$N$1, 0)), \"\")","v":0},{"$f":"IFERROR(INDEX(SUDAC_EKIPE!$C$2:$N$51, ROWS($A$1:A48), MATCH($E$4, SUDAC_EKIPE!$C$1:$N$1, 0)), \"\")","v":0},{"$f":"IFERROR(INDEX(SUDAC_EKIPE!$C$2:$N$51, ROWS($A$1:A48), MATCH($B$12, SUDAC_EKIPE!$C$1:$N$1, 0)), \"\")","v":0},{"$f":"IFERROR(INDEX(SUDAC_EKIPE!$C$2:$N$51, ROWS($A$1:A48), MATCH($E$12, SUDAC_EKIPE!$C$1:$N$1, 0)), \"\")","v":0}]
[null,null,null,null,null,null,null,null,null,null,null,null,null,null,null,null,null,null,null,null,null,null,null,null,null,null,null,null,null,null,null,null,null,null,{"$f":"IFERROR(INDEX(SUDAC_EKIPE!$C$2:$N$51, ROWS($A$1:A49), MATCH($B$4, SUDAC_EKIPE!$C$1:$N$1, 0)), \"\")","v":0},{"$f":"IFERROR(INDEX(SUDAC_EKIPE!$C$2:$N$51, ROWS($A$1:A49), MATCH($E$4, SUDAC_EKIPE!$C$1:$N$1, 0)), \"\")","v":0},{"$f":"IFERROR(INDEX(SUDAC_EKIPE!$C$2:$N$51, ROWS($A$1:A49), MATCH($B$12, SUDAC_EKIPE!$C$1:$N$1, 0)), \"\")","v":0},{"$f":"IFERROR(INDEX(SUDAC_EKIPE!$C$2:$N$51, ROWS($A$1:A49), MATCH($E$12, SUDAC_EKIPE!$C$1:$N$1, 0)), \"\")","v":0}]
[null,null,null,null,null,null,null,null,null,null,null,null,null,null,null,null,null,null,null,null,null,null,null,null,null,null,null,null,null,null,null,null,null,null,{"$f":"IFERROR(INDEX(SUDAC_EKIPE!$C$2:$N$51, ROWS($A$1:A50), MATCH($B$4, SUDAC_EKIPE!$C$1:$N$1, 0)), \"\")","v":0},{"$f":"IFERROR(INDEX(SUDAC_EKIPE!$C$2:$N$51, ROWS($A$1:A50), MATCH($E$4, SUDAC_EKIPE!$C$1:$N$1, 0)), \"\")","v":0},{"$f":"IFERROR(INDEX(SUDAC_EKIPE!$C$2:$N$51, ROWS($A$1:A50), MATCH($B$12, SUDAC_EKIPE!$C$1:$N$1, 0)), \"\")","v":0},{"$f":"IFERROR(INDEX(SUDAC_EKIPE!$C$2:$N$51, ROWS($A$1:A50), MATCH($E$12, SUDAC_EKIPE!$C$1:$N$1, 0)), \"\")","v":0}]

{"sheet":"ZAPISNIK_1_1","index":5,"n_rows":24,"n_cols":48,"rows_kept":24,"cut":false,"hidden":true,"merged":[[2,23,2,27],[0,0,0,27],[1,1,1,3],[1,4,1,8],[1,9,1,12],[1,13,1,18],[1,19,1,22],[1,23,1,27],[2,1,2,3],[2,4,2,8],[2,9,2,12],[2,13,2,18],[2,19,2,22]]}
["ŽUPANIJSKA LIGA STSIŽ 2025./2026",null,null,null,null,null,null,null,null,null,null,null,null,null,null,null,null,null,null,null,null,null,null,null,null,null,null,null,null,null,null,null,null,null,null,null,null,null,null,null,null,null,null,null,null,null,null,"EDIT"]
[null,"GRAD DOMAĆIN",null,null,"DVORANA",null,null,null,null,"KOLO",null,null,null,"DATUM",null,null,null,null,null,"SAT"]
[null,"PAZIN",null,null,"Sportska dvorana Pazin",null,null,null,null,"1.",null,null,null,"18. 10. 2025.",null,null,null,null,null,"17:00:00"]
["Domaćin","PAZIN",null,"Gost","MAESTRAL 2"]
["A","GLAVINIĆ Denis",null,"X","MILAKOVIĆ Borna"]
["B","FABRIS Karlo",null,"Y","SINČIĆ Luana"]
["C","LUKEZ Goran",null,"Z","SMAIĆ Bruno",null,null,null,null,null," "]
["R1",null,null,"R1"]
["R2",null,null,"R2"]
[]
[null,"DOMAĆIN",null,null,"GOST"]
[null,"PAZIN",null,null,"MAESTRAL 2"]
[null,"GLAVINIĆ Denis","A","X","MILAKOVIĆ Borna",12,null,10,11,null,6,11,null,9,null,null,null,null,null,null,null,{"$f":"IF(COUNTA(F13:T13)=0,\"\",_xlfn.LET(_xlpm.h,CHOOSE({1,2,3,4,5},F13,I13,L13,O13,R13),_xlpm.a,CHOOSE({1,2,3,4,5},H13,K13,N13,Q13,T13),SUM((_xlpm.h>_xlpm.a)*(_xlpm.h<>\"\")*(_xlpm.a<>\"\"))))","v":3},":",{"$f":"IF(COUNTA(F13:T13)=0,\"\",_xlfn.LET(_xlpm.h,CHOOSE({1,2,3,4,5},F13,I13,L13,O13,R13),_xlpm.a,CHOOSE({1,2,3,4,5},H13,K13,N13,Q13,T13),SUM((_xlpm.a>_xlpm.h)*(_xlpm.h<>\"\")*(_xlpm.a<>\"\"))))","v":0},{"$f":"IF(OR(V13=\"\",X13=\"\"),\"\",IF(MAX(V13,X13)<3,\"\",SUMPRODUCT(--($V$13:V13>$X$13:X13),--(($V$13:V13>=3)+($X$13:X13>=3)>0))))","v":1},":",{"$f":"IF(OR(V13=\"\",X13=\"\"),\"\",IF(MAX(V13,X13)<3,\"\",SUMPRODUCT(--($X$13:X13>$V$13:V13),--(($V$13:V13>=3)+($X$13:X13>=3)>0))))","v":0}]
[null,"FABRIS Karlo","B","Y","SINČIĆ Luana",6,null,11,11,null,5,11,null,5,11,null,2,null,null,null,null,{"$f":"IF(COUNTA(F14:T14)=0,\"\",_xlfn.LET(_xlpm.h,CHOOSE({1,2,3,4,5},F14,I14,L14,O14,R14),_xlpm.a,CHOOSE({1,2,3,4,5},H14,K14,N14,Q14,T14),SUM((_xlpm.h>_xlpm.a)*(_xlpm.h<>\"\")*(_xlpm.a<>\"\"))))","v":3},":",{"$f":"IF(COUNTA(F14:T14)=0,\"\",_xlfn.LET(_xlpm.h,CHOOSE({1,2,3,4,5},F14,I14,L14,O14,R14),_xlpm.a,CHOOSE({1,2,3,4,5},H14,K14,N14,Q14,T14),SUM((_xlpm.a>_xlpm.h)*(_xlpm.h<>\"\")*(_xlpm.a<>\"\"))))","v":1},{"$f":"IF(OR(V14=\"\",X14=\"\"),\"\",IF(MAX(V14,X14)<3,\"\",SUMPRODUCT(--($V$13:V14>$X$13:X14),--(($V$13:V14>=3)+($X$13:X14>=3)>0))))","v":2},":",{"$f":"IF(OR(V14=\"\",X14=\"\"),\"\",IF(MAX(V14,X14)<3,\"\",SUMPRODUCT(--($X$13:X14>$V$13:V14),--(($V$13:V14>=3)+($X$13:X14>=3)>0))))","v":0}]
[null,"LUKEZ Goran","C","Z","SMAIĆ Bruno",9,null,11,11,null,2,11,null,8,11,null,5,null,null,null,null,{"$f":"IF(COUNTA(F15:T15)=0,\"\",_xlfn.LET(_xlpm.h,CHOOSE({1,2,3,4,5},F15,I15,L15,O15,R15),_xlpm.a,CHOOSE({1,2,3,4,5},H15,K15,N15,Q15,T15),SUM((_xlpm.h>_xlpm.a)*(_xlpm.h<>\"\")*(_xlpm.a<>\"\"))))","v":3},":",{"$f":"IF(COUNTA(F15:T15)=0,\"\",_xlfn.LET(_xlpm.h,CHOOSE({1,2,3,4,5},F15,I15,L15,O15,R15),_xlpm.a,CHOOSE({1,2,3,4,5},H15,K15,N15,Q15,T15),SUM((_xlpm.a>_xlpm.h)*(_xlpm.h<>\"\")*(_xlpm.a<>\"\"))))","v":1},{"$f":"IF(OR(V15=\"\",X15=\"\"),\"\",IF(MAX(V15,X15)<3,\"\",SUMPRODUCT(--($V$13:V15>$X$13:X15),--(($V$13:V15>=3)+($X$13:X15>=3)>0))))","v":3},":",{"$f":"IF(OR(V15=\"\",X15=\"\"),\"\",IF(MAX(V15,X15)<3,\"\",SUMPRODUCT(--($X$13:X15>$V$13:V15),--(($V$13:V15>=3)+($X$13:X15>=3)>0))))","v":0}]
[null,"GLAVINIĆ D., LUKEZ G.","PAR","PAR","MILAKOVIĆ B., SINČIĆ L.",11,null,6,11,null,7,11,null,5,null,null,null,null,null,null,null,{"$f":"IF(COUNTA(F16:T16)=0,\"\",_xlfn.LET(_xlpm.h,CHOOSE({1,2,3,4,5},F16,I16,L16,O16,R16),_xlpm.a,CHOOSE({1,2,3,4,5},H16,K16,N16,Q16,T16),SUM((_xlpm.h>_xlpm.a)*(_xlpm.h<>\"\")*(_xlpm.a<>\"\"))))","v":3},":",{"$f":"IF(COUNTA(F16:T16)=0,\"\",_xlfn.LET(_xlpm.h,CHOOSE({1,2,3,4,5},F16,I16,L16,O16,R16),_xlpm.a,CHOOSE({1,2,3,4,5},H16,K16,N16,Q16,T16),SUM((_xlpm.a>_xlpm.h)*(_xlpm.h<>\"\")*(_xlpm.a<>\"\"))))","v":0},{"$f":"IF(OR(V16=\"\",X16=\"\"),\"\",IF(MAX(V16,X16)<3,\"\",SUMPRODUCT(--($V$13:V16>$X$13:X16),--(($V$13:V16>=3)+($X$13:X16>=3)>0))))","v":4},":",{"$f":"IF(OR(V16=\"\",X16=\"\"),\"\",IF(MAX(V16,X16)<3,\"\",SUMPRODUCT(--($X$13:X16>$V$13:V16),--(($V$13:V16>=3)+($X$13:X16>=3)>0))))","v":0}]
[null,1,null,null,null,null,null,null,null,null,null,null,null,null,null,null,null,null,null,null,null,{"$f":"IF(COUNTA(F17:T17)=0,\"\",_xlfn.LET(_xlpm.h,CHOOSE({1,2,3,4,5},F17,I17,L17,O17,R17),_xlpm.a,CHOOSE({1,2,3,4,5},H17,K17,N17,Q17,T17),SUM((_xlpm.h>_xlpm.a)*(_xlpm.h<>\"\")*(_xlpm.a<>\"\"))))","v":""},":",{"$f":"IF(COUNTA(F17:T17)=0,\"\",_xlfn.LET(_xlpm.h,CHOOSE({1,2,3,4,5},F17,I17,L17,O17,R17),_xlpm.a,CHOOSE({1,2,3,4,5},H17,K17,N17,Q17,T17),SUM((_xlpm.a>_xlpm.h)*(_xlpm.h<>\"\")*(_xlpm.a<>\"\"))))","v":""},{"$f":"IF(OR(V17=\"\",X17=\"\"),\"\",IF(MAX(V17,X17)<3,\"\",SUMPRODUCT(--($V$13:V17>$X$13:X17),--(($V$13:V17>=3)+($X$13:X17>=3)>0))))","v":""},":",{"$f":"IF(OR(V17=\"\",X17=\"\"),\"\",IF(MAX(V17,X17)<3,\"\",SUMPRODUCT(--($X$13:X17>$V$13:V17),--(($V$13:V17>=3)+($X$13:X17>=3)>0))))","v":""}]
[null,null,"A","Y",null,null,null,null,null,null,null,null,null,null,null,null,null,null,null,null,null,{"$f":"IF(COUNTA(F18:T18)=0,\"\",_xlfn.LET(_xlpm.h,CHOOSE({1,2,3,4,5},F18,I18,L18,O18,R18),_xlpm.a,CHOOSE({1,2,3,4,5},H18,K18,N18,Q18,T18),SUM((_xlpm.h>_xlpm.a)*(_xlpm.h<>\"\")*(_xlpm.a<>\"\"))))","v":""},":",{"$f":"IF(COUNTA(F18:T18)=0,\"\",_xlfn.LET(_xlpm.h,CHOOSE({1,2,3,4,5},F18,I18,L18,O18,R18),_xlpm.a,CHOOSE({1,2,3,4,5},H18,K18,N18,Q18,T18),SUM((_xlpm.a>_xlpm.h)*(_xlpm.h<>\"\")*(_xlpm.a<>\"\"))))","v":""},{"$f":"IF(OR(V18=\"\",X18=\"\"),\"\",IF(MAX(V18,X18)<3,\"\",SUMPRODUCT(--($V$13:V18>$X$13:X18),--(($V$13:V18>=3)+($X$13:X18>=3)>0))))","v":""},":",{"$f":"IF(OR(V18=\"\",X18=\"\"),\"\",IF(MAX(V18,X18)<3,\"\",SUMPRODUCT(--($X$13:X18>$V$13:V18),--(($V$13:V18>=3)+($X$13:X18>=3)>0))))","v":""}]
[null,null,"C","X",null,null,null,null,null,null,null,null,null,null,null,null,null,null,null,null,null,{"$f":"IF(COUNTA(F19:T19)=0,\"\",_xlfn.LET(_xlpm.h,CHOOSE({1,2,3,4,5},F19,I19,L19,O19,R19),_xlpm.a,CHOOSE({1,2,3,4,5},H19,K19,N19,Q19,T19),SUM((_xlpm.h>_xlpm.a)*(_xlpm.h<>\"\")*(_xlpm.a<>\"\"))))","v":""},":",{"$f":"IF(COUNTA(F19:T19)=0,\"\",_xlfn.LET(_xlpm.h,CHOOSE({1,2,3,4,5},F19,I19,L19,O19,R19),_xlpm.a,CHOOSE({1,2,3,4,5},H19,K19,N19,Q19,T19),SUM((_xlpm.a>_xlpm.h)*(_xlpm.h<>\"\")*(_xlpm.a<>\"\"))))","v":""},{"$f":"IF(OR(V19=\"\",X19=\"\"),\"\",IF(MAX(V19,X19)<3,\"\",SUMPRODUCT(--($V$13:V19>$X$13:X19),--(($V$13:V19>=3)+($X$13:X19>=3)>0))))","v":""},":",{"$f":"IF(OR(V19=\"\",X19=\"\"),\"\",IF(MAX(V19,X19)<3,\"\",SUMPRODUCT(--($X$13:X19>$V$13:V19),--(($V$13:V19>=3)+($X$13:X19>=3)>0))))","v":""}]
[null,null,"B","Z",null,null,null,null,null,null,null,null,null,null,null,null,null,null,null,null,null,{"$f":"IF(COUNTA(F20:T20)=0,\"\",_xlfn.LET(_xlpm.h,CHOOSE({1,2,3,4,5},F20,I20,L20,O20,R20),_xlpm.a,CHOOSE({1,2,3,4,5},H20,K20,N20,Q20,T20),SUM((_xlpm.h>_xlpm.a)*(_xlpm.h<>\"\")*(_xlpm.a<>\"\"))))","v":""},":",{"$f":"IF(COUNTA(F20:T20)=0,\"\",_xlfn.LET(_xlpm.h,CHOOSE({1,2,3,4,5},F20,I20,L20,O20,R20),_xlpm.a,CHOOSE({1,2,3,4,5},H20,K20,N20,Q20,T20),SUM((_xlpm.a>_xlpm.h)*(_xlpm.h<>\"\")*(_xlpm.a<>\"\"))))","v":""},{"$f":"IF(OR(V20=\"\",X20=\"\"),\"\",IF(MAX(V20,X20)<3,\"\",SUMPRODUCT(--($V$13:V20>$X$13:X20),--(($V$13:V20>=3)+($X$13:X20>=3)>0))))","v":""},":",{"$f":"IF(OR(V20=\"\",X20=\"\"),\"\",IF(MAX(V20,X20)<3,\"\",SUMPRODUCT(--($X$13:X20>$V$13:V20),--(($V$13:V20>=3)+($X$13:X20>=3)>0))))","v":""}]
[]
[null,{"$f":"B4","v":"PAZIN"},":",null,{"$f":"E4","v":"MAESTRAL 2"},{"$f":"MAX(Y13:Y20)","v":4},":",{"$f":"MAX(AA13:AA20)","v":0}]
[null,null,null,null,"SETOVI",{"$f":"SUM(V13:V20)","v":12},":",{"$f":"SUM(X13:X20)","v":2}]
[null,null,null,null,"POENI",{"$f":"SUM(F13:F20, I13:I20, L13:L20, O13:O20, R13:R20)","v":148},":",{"$f":"SUM(H13:H20, K13:K20, N13:N20, Q13:Q20, T13:T20)","v":92}]

{"sheet":"ZAPISNIK_1_2","index":6,"n_rows":24,"n_cols":48,"rows_kept":24,"cut":false,"hidden":true,"merged":[[2,23,2,27],[0,0,0,27],[1,1,1,3],[1,4,1,8],[1,9,1,12],[1,13,1,18],[1,19,1,22],[1,23,1,27],[2,1,2,3],[2,4,2,8],[2,9,2,12],[2,13,2,18],[2,19,2,22]]}
["ŽUPANIJSKA LIGA STSIŽ 2025./2026",null,null,null,null,null,null,null,null,null,null,null,null,null,null,null,null,null,null,null,null,null,null,null,null,null,null,null,null,null,null,null,null,null,null,null,null,null,null,null,null,null,null,null,null,null,null,"EDIT"]
[null,"GRAD DOMAĆIN",null,null,"DVORANA",null,null,null,null,"KOLO",null,null,null,"DATUM",null,null,null,null,null,"SAT"]
[null,"BUZET",null,null,"SD Buzet",null,null,null,null,"1.",null,null,null,"7. 10. 2025.",null,null,null,null,null,"20:30:00"]
["Domaćin","BUZET 1",null,"Gost","BUZET 2"]
["A","PAULUS Michael",null,"X","DRAŠĆIĆ Petar"]
["B","BERDNYK Stanislav",null,"Y","PAVLETIĆ Guido"]
["C","SIROTIĆ Kevin",null,"Z","KOS Dino",null,null,null,null,null," "]
["R1",null,null,"R1"]
["R2",null,null,"R2"]
[]
[null,"DOMAĆIN",null,null,"GOST"]
[null,"BUZET 1",null,null,"BUZET 2"]
[null,"PAULUS Michael","A","X","DRAŠĆIĆ Petar",11,":",13,7,":",11,5,":",11,null,":",null,null,":",null,null,{"$f":"IF(COUNTA(F13:T13)=0,\"\",_xlfn.LET(_xlpm.h,CHOOSE({1,2,3,4,5},F13,I13,L13,O13,R13),_xlpm.a,CHOOSE({1,2,3,4,5},H13,K13,N13,Q13,T13),SUM((_xlpm.h>_xlpm.a)*(_xlpm.h<>\"\")*(_xlpm.a<>\"\"))))","v":0},":",{"$f":"IF(COUNTA(F13:T13)=0,\"\",_xlfn.LET(_xlpm.h,CHOOSE({1,2,3,4,5},F13,I13,L13,O13,R13),_xlpm.a,CHOOSE({1,2,3,4,5},H13,K13,N13,Q13,T13),SUM((_xlpm.a>_xlpm.h)*(_xlpm.h<>\"\")*(_xlpm.a<>\"\"))))","v":3},{"$f":"IF(OR(V13=\"\",X13=\"\"),\"\",IF(MAX(V13,X13)<3,\"\",SUMPRODUCT(--($V$13:V13>$X$13:X13),--(($V$13:V13>=3)+($X$13:X13>=3)>0))))","v":0},":",{"$f":"IF(OR(V13=\"\",X13=\"\"),\"\",IF(MAX(V13,X13)<3,\"\",SUMPRODUCT(--($X$13:X13>$V$13:V13),--(($V$13:V13>=3)+($X$13:X13>=3)>0))))","v":1}]
[null,"BERDNYK Stanislav","B","Y","PAVLETIĆ Guido",11,":",4,11,":",8,11,":",7,null,":",null,null,":",null,null,{"$f":"IF(COUNTA(F14:T14)=0,\"\",_xlfn.LET(_xlpm.h,CHOOSE({1,2,3,4,5},F14,I14,L14,O14,R14),_xlpm.a,CHOOSE({1,2,3,4,5},H14,K14,N14,Q14,T14),SUM((_xlpm.h>_xlpm.a)*(_xlpm.h<>\"\")*(_xlpm.a<>\"\"))))","v":3},":",{"$f":"IF(COUNTA(F14:T14)=0,\"\",_xlfn.LET(_xlpm.h,CHOOSE({1,2,3,4,5},F14,I14,L14,O14,R14),_xlpm.a,CHOOSE({1,2,3,4,5},H14,K14,N14,Q14,T14),SUM((_xlpm.a>_xlpm.h)*(_xlpm.h<>\"\")*(_xlpm.a<>\"\"))))","v":0},{"$f":"IF(OR(V14=\"\",X14=\"\"),\"\",IF(MAX(V14,X14)<3,\"\",SUMPRODUCT(--($V$13:V14>$X$13:X14),--(($V$13:V14>=3)+($X$13:X14>=3)>0))))","v":1},":",{"$f":"IF(OR(V14=\"\",X14=\"\"),\"\",IF(MAX(V14,X14)<3,\"\",SUMPRODUCT(--($X$13:X14>$V$13:V14),--(($V$13:V14>=3)+($X$13:X14>=3)>0))))","v":1}]
[null,"SIROTIĆ Kevin","C","Z","KOS Dino",11,":",6,13,":",11,11,":",8,null,":",null,null,":",null,null,{"$f":"IF(COUNTA(F15:T15)=0,\"\",_xlfn.LET(_xlpm.h,CHOOSE({1,2,3,4,5},F15,I15,L15,O15,R15),_xlpm.a,CHOOSE({1,2,3,4,5},H15,K15,N15,Q15,T15),SUM((_xlpm.h>_xlpm.a)*(_xlpm.h<>\"\")*(_xlpm.a<>\"\"))))","v":3},":",{"$f":"IF(COUNTA(F15:T15)=0,\"\",_xlfn.LET(_xlpm.h,CHOOSE({1,2,3,4,5},F15,I15,L15,O15,R15),_xlpm.a,CHOOSE({1,2,3,4,5},H15,K15,N15,Q15,T15),SUM((_xlpm.a>_xlpm.h)*(_xlpm.h<>\"\")*(_xlpm.a<>\"\"))))","v":0},{"$f":"IF(OR(V15=\"\",X15=\"\"),\"\",IF(MAX(V15,X15)<3,\"\",SUMPRODUCT(--($V$13:V15>$X$13:X15),--(($V$13:V15>=3)+($X$13:X15>=3)>0))))","v":2},":",{"$f":"IF(OR(V15=\"\",X15=\"\"),\"\",IF(MAX(V15,X15)<3,\"\",SUMPRODUCT(--($X$13:X15>$V$13:V15),--(($V$13:V15>=3)+($X$13:X15>=3)>0))))","v":1}]
[null,"BERDNYK S., PAULUS M.","PAR","PAR","DRAŠĆIĆ P., PAVLETIĆ G.",11,":",4,12,":",10,11,":",5,null,":",null,null,":",null,null,{"$f":"IF(COUNTA(F16:T16)=0,\"\",_xlfn.LET(_xlpm.h,CHOOSE({1,2,3,4,5},F16,I16,L16,O16,R16),_xlpm.a,CHOOSE({1,2,3,4,5},H16,K16,N16,Q16,T16),SUM((_xlpm.h>_xlpm.a)*(_xlpm.h<>\"\")*(_xlpm.a<>\"\"))))","v":3},":",{"$f":"IF(COUNTA(F16:T16)=0,\"\",_xlfn.LET(_xlpm.h,CHOOSE({1,2,3,4,5},F16,I16,L16,O16,R16),_xlpm.a,CHOOSE({1,2,3,4,5},H16,K16,N16,Q16,T16),SUM((_xlpm.a>_xlpm.h)*(_xlpm.h<>\"\")*(_xlpm.a<>\"\"))))","v":0},{"$f":"IF(OR(V16=\"\",X16=\"\"),\"\",IF(MAX(V16,X16)<3,\"\",SUMPRODUCT(--($V$13:V16>$X$13:X16),--(($V$13:V16>=3)+($X$13:X16>=3)>0))))","v":3},":",{"$f":"IF(OR(V16=\"\",X16=\"\"),\"\",IF(MAX(V16,X16)<3,\"\",SUMPRODUCT(--($X$13:X16>$V$13:V16),--(($V$13:V16>=3)+($X$13:X16>=3)>0))))","v":1}]
[null,null,null,null,null,null,null,null,null,null,null,null,null,null,null,null,null,null,null,null,null,{"$f":"IF(COUNTA(F17:T17)=0,\"\",_xlfn.LET(_xlpm.h,CHOOSE({1,2,3,4,5},F17,I17,L17,O17,R17),_xlpm.a,CHOOSE({1,2,3,4,5},H17,K17,N17,Q17,T17),SUM((_xlpm.h>_xlpm.a)*(_xlpm.h<>\"\")*(_xlpm.a<>\"\"))))","v":""},":",{"$f":"IF(COUNTA(F17:T17)=0,\"\",_xlfn.LET(_xlpm.h,CHOOSE({1,2,3,4,5},F17,I17,L17,O17,R17),_xlpm.a,CHOOSE({1,2,3,4,5},H17,K17,N17,Q17,T17),SUM((_xlpm.a>_xlpm.h)*(_xlpm.h<>\"\")*(_xlpm.a<>\"\"))))","v":""},{"$f":"IF(OR(V17=\"\",X17=\"\"),\"\",IF(MAX(V17,X17)<3,\"\",SUMPRODUCT(--($V$13:V17>$X$13:X17),--(($V$13:V17>=3)+($X$13:X17>=3)>0))))","v":""},":",{"$f":"IF(OR(V17=\"\",X17=\"\"),\"\",IF(MAX(V17,X17)<3,\"\",SUMPRODUCT(--($X$13:X17>$V$13:V17),--(($V$13:V17>=3)+($X$13:X17>=3)>0))))","v":""}]
[null,"PAULUS Michael","A","Y","PAVLETIĆ Guido",10,":",12,11,":",5,11,":",9,11,":",4,null,":",null,null,{"$f":"IF(COUNTA(F18:T18)=0,\"\",_xlfn.LET(_xlpm.h,CHOOSE({1,2,3,4,5},F18,I18,L18,O18,R18),_xlpm.a,CHOOSE({1,2,3,4,5},H18,K18,N18,Q18,T18),SUM((_xlpm.h>_xlpm.a)*(_xlpm.h<>\"\")*(_xlpm.a<>\"\"))))","v":3},":",{"$f":"IF(COUNTA(F18:T18)=0,\"\",_xlfn.LET(_xlpm.h,CHOOSE({1,2,3,4,5},F18,I18,L18,O18,R18),_xlpm.a,CHOOSE({1,2,3,4,5},H18,K18,N18,Q18,T18),SUM((_xlpm.a>_xlpm.h)*(_xlpm.h<>\"\")*(_xlpm.a<>\"\"))))","v":1},{"$f":"IF(OR(V18=\"\",X18=\"\"),\"\",IF(MAX(V18,X18)<3,\"\",SUMPRODUCT(--($V$13:V18>$X$13:X18),--(($V$13:V18>=3)+($X$13:X18>=3)>0))))","v":4},":",{"$f":"IF(OR(V18=\"\",X18=\"\"),\"\",IF(MAX(V18,X18)<3,\"\",SUMPRODUCT(--($X$13:X18>$V$13:V18),--(($V$13:V18>=3)+($X$13:X18>=3)>0))))","v":1}]
[null,null,"C","X",null,null,":",null,null,":",null,null,":",null,null,":",null,null,":",null,null,{"$f":"IF(COUNTA(F19:T19)=0,\"\",_xlfn.LET(_xlpm.h,CHOOSE({1,2,3,4,5},F19,I19,L19,O19,R19),_xlpm.a,CHOOSE({1,2,3,4,5},H19,K19,N19,Q19,T19),SUM((_xlpm.h>_xlpm.a)*(_xlpm.h<>\"\")*(_xlpm.a<>\"\"))))","v":0},":",{"$f":"IF(COUNTA(F19:T19)=0,\"\",_xlfn.LET(_xlpm.h,CHOOSE({1,2,3,4,5},F19,I19,L19,O19,R19),_xlpm.a,CHOOSE({1,2,3,4,5},H19,K19,N19,Q19,T19),SUM((_xlpm.a>_xlpm.h)*(_xlpm.h<>\"\")*(_xlpm.a<>\"\"))))","v":0},{"$f":"IF(OR(V19=\"\",X19=\"\"),\"\",IF(MAX(V19,X19)<3,\"\",SUMPRODUCT(--($V$13:V19>$X$13:X19),--(($V$13:V19>=3)+($X$13:X19>=3)>0))))","v":""},":",{"$f":"IF(OR(V19=\"\",X19=\"\"),\"\",IF(MAX(V19,X19)<3,\"\",SUMPRODUCT(--($X$13:X19>$V$13:V19),--(($V$13:V19>=3)+($X$13:X19>=3)>0))))","v":""}]
[null,null,"B","Z",null,null,":",null,null,":",null,null,":",null,null,":",null,null,":",null,null,{"$f":"IF(COUNTA(F20:T20)=0,\"\",_xlfn.LET(_xlpm.h,CHOOSE({1,2,3,4,5},F20,I20,L20,O20,R20),_xlpm.a,CHOOSE({1,2,3,4,5},H20,K20,N20,Q20,T20),SUM((_xlpm.h>_xlpm.a)*(_xlpm.h<>\"\")*(_xlpm.a<>\"\"))))","v":0},":",{"$f":"IF(COUNTA(F20:T20)=0,\"\",_xlfn.LET(_xlpm.h,CHOOSE({1,2,3,4,5},F20,I20,L20,O20,R20),_xlpm.a,CHOOSE({1,2,3,4,5},H20,K20,N20,Q20,T20),SUM((_xlpm.a>_xlpm.h)*(_xlpm.h<>\"\")*(_xlpm.a<>\"\"))))","v":0},{"$f":"IF(OR(V20=\"\",X20=\"\"),\"\",IF(MAX(V20,X20)<3,\"\",SUMPRODUCT(--($V$13:V20>$X$13:X20),--(($V$13:V20>=3)+($X$13:X20>=3)>0))))","v":""},":",{"$f":"IF(OR(V20=\"\",X20=\"\"),\"\",IF(MAX(V20,X20)<3,\"\",SUMPRODUCT(--($X$13:X20>$V$13:V20),--(($V$13:V20>=3)+($X$13:X20>=3)>0))))","v":""}]
[]
[null,{"$f":"B4","v":"BUZET 1"},":",null,{"$f":"E4","v":"BUZET 2"},{"$f":"MAX(Y13:Y20)","v":4},":",{"$f":"MAX(AA13:AA20)","v":1}]
[null,null,null,null,"SETOVI",{"$f":"SUM(V13:V20)","v":12},":",{"$f":"SUM(X13:X20)","v":4}]
[null,null,null,null,"POENI",{"$f":"SUM(F13:F20, I13:I20, L13:L20, O13:O20, R13:R20)","v":168},":",{"$f":"SUM(H13:H20, K13:K20, N13:N20, Q13:Q20, T13:T20)","v":128}]

{"sheet":"ZAPISNIK_1_3","index":7,"n_rows":24,"n_cols":48,"rows_kept":24,"cut":false,"hidden":true,"merged":[[2,23,2,27],[0,0,0,27],[1,1,1,3],[1,4,1,8],[1,9,1,12],[1,13,1,18],[1,19,1,22],[1,23,1,27],[2,1,2,3],[2,4,2,8],[2,9,2,12],[2,13,2,18],[2,19,2,22]]}
["ŽUPANIJSKA LIGA STSIŽ 2025./2026",null,null,null,null,null,null,null,null,null,null,null,null,null,null,null,null,null,null,null,null,null,null,null,null,null,null,null,null,null,null,null,null,null,null,null,null,null,null,null,null,null,null,null,null,null,null,"EDIT"]
[null,"GRAD DOMAĆIN",null,null,"DVORANA",null,null,null,null,"KOLO",null,null,null,"DATUM",null,null,null,null,null,"SAT"]
[null,"PULA",null,null,"Dvorana STK Arena Ferro, Rojc",null,null,null,null,"1.",null,null,null,"15. 10. 2025.",null,null,null,null,null,"17:30:00"]
["Domaćin","ARENA FERRO",null,"Gost","VAL SHARK"]
["A","CINKOPAN Kristijan",null,"X","INFANTOLINO Davide"]
["B","KRANJC Dino",null,"Y","HRVANOVIĆ Jasmin"]
["C","PEKICA Bartol",null,"Z","IVINIĆ Serđo",null,null,null,null,null," "]
["R1",null,null,"R1"]
["R2",null,null,"R2"]
[]
[null,"DOMAĆIN",null,null,"GOST"]
[null,"ARENA FERRO",null,null,"VAL SHARK"]
[null,"CINKOPAN Kristijan","A","X","INFANTOLINO Davide",9,":",11,11,":",4,1,":",11,20,":",18,11,":",9,null,{"$f":"IF(COUNTA(F13:T13)=0,\"\",_xlfn.LET(_xlpm.h,CHOOSE({1,2,3,4,5},F13,I13,L13,O13,R13),_xlpm.a,CHOOSE({1,2,3,4,5},H13,K13,N13,Q13,T13),SUM((_xlpm.h>_xlpm.a)*(_xlpm.h<>\"\")*(_xlpm.a<>\"\"))))","v":3},":",{"$f":"IF(COUNTA(F13:T13)=0,\"\",_xlfn.LET(_xlpm.h,CHOOSE({1,2,3,4,5},F13,I13,L13,O13,R13),_xlpm.a,CHOOSE({1,2,3,4,5},H13,K13,N13,Q13,T13),SUM((_xlpm.a>_xlpm.h)*(_xlpm.h<>\"\")*(_xlpm.a<>\"\"))))","v":2},{"$f":"IF(OR(V13=\"\",X13=\"\"),\"\",IF(MAX(V13,X13)<3,\"\",SUMPRODUCT(--($V$13:V13>$X$13:X13),--(($V$13:V13>=3)+($X$13:X13>=3)>0))))","v":1},":",{"$f":"IF(OR(V13=\"\",X13=\"\"),\"\",IF(MAX(V13,X13)<3,\"\",SUMPRODUCT(--($X$13:X13>$V$13:V13),--(($V$13:V13>=3)+($X$13:X13>=3)>0))))","v":0}]
[null,"KRANJC Dino","B","Y","HRVANOVIĆ Jasmin",11,":",6,11,":",9,11,":",3,null,":",null,null,":",null,null,{"$f":"IF(COUNTA(F14:T14)=0,\"\",_xlfn.LET(_xlpm.h,CHOOSE({1,2,3,4,5},F14,I14,L14,O14,R14),_xlpm.a,CHOOSE({1,2,3,4,5},H14,K14,N14,Q14,T14),SUM((_xlpm.h>_xlpm.a)*(_xlpm.h<>\"\")*(_xlpm.a<>\"\"))))","v":3},":",{"$f":"IF(COUNTA(F14:T14)=0,\"\",_xlfn.LET(_xlpm.h,CHOOSE({1,2,3,4,5},F14,I14,L14,O14,R14),_xlpm.a,CHOOSE({1,2,3,4,5},H14,K14,N14,Q14,T14),SUM((_xlpm.a>_xlpm.h)*(_xlpm.h<>\"\")*(_xlpm.a<>\"\"))))","v":0},{"$f":"IF(OR(V14=\"\",X14=\"\"),\"\",IF(MAX(V14,X14)<3,\"\",SUMPRODUCT(--($V$13:V14>$X$13:X14),--(($V$13:V14>=3)+($X$13:X14>=3)>0))))","v":2},":",{"$f":"IF(OR(V14=\"\",X14=\"\"),\"\",IF(MAX(V14,X14)<3,\"\",SUMPRODUCT(--($X$13:X14>$V$13:V14),--(($V$13:V14>=3)+($X$13:X14>=3)>0))))","v":0}]
[null,"PEKICA Bartol","C","Z","IVINIĆ Serđo",11,":",9,5,":",11,11,":",6,11,":",8,null,":",null,null,{"$f":"IF(COUNTA(F15:T15)=0,\"\",_xlfn.LET(_xlpm.h,CHOOSE({1,2,3,4,5},F15,I15,L15,O15,R15),_xlpm.a,CHOOSE({1,2,3,4,5},H15,K15,N15,Q15,T15),SUM((_xlpm.h>_xlpm.a)*(_xlpm.h<>\"\")*(_xlpm.a<>\"\"))))","v":3},":",{"$f":"IF(COUNTA(F15:T15)=0,\"\",_xlfn.LET(_xlpm.h,CHOOSE({1,2,3,4,5},F15,I15,L15,O15,R15),_xlpm.a,CHOOSE({1,2,3,4,5},H15,K15,N15,Q15,T15),SUM((_xlpm.a>_xlpm.h)*(_xlpm.h<>\"\")*(_xlpm.a<>\"\"))))","v":1},{"$f":"IF(OR(V15=\"\",X15=\"\"),\"\",IF(MAX(V15,X15)<3,\"\",SUMPRODUCT(--($V$13:V15>$X$13:X15),--(($V$13:V15>=3)+($X$13:X15>=3)>0))))","v":3},":",{"$f":"IF(OR(V15=\"\",X15=\"\"),\"\",IF(MAX(V15,X15)<3,\"\",SUMPRODUCT(--($X$13:X15>$V$13:V15),--(($V$13:V15>=3)+($X$13:X15>=3)>0))))","v":0}]
[null,"CINKOPAN K., PEKICA B.","PAR","PAR","HRVANOVIĆ J., IVINIĆ S.",11,":",9,6,":",11,11,":",7,11,":",4,null,":",null,null,{"$f":"IF(COUNTA(F16:T16)=0,\"\",_xlfn.LET(_xlpm.h,CHOOSE({1,2,3,4,5},F16,I16,L16,O16,R16),_xlpm.a,CHOOSE({1,2,3,4,5},H16,K16,N16,Q16,T16),SUM((_xlpm.h>_xlpm.a)*(_xlpm.h<>\"\")*(_xlpm.a<>\"\"))))","v":3},":",{"$f":"IF(COUNTA(F16:T16)=0,\"\",_xlfn.LET(_xlpm.h,CHOOSE({1,2,3,4,5},F16,I16,L16,O16,R16),_xlpm.a,CHOOSE({1,2,3,4,5},H16,K16,N16,Q16,T16),SUM((_xlpm.a>_xlpm.h)*(_xlpm.h<>\"\")*(_xlpm.a<>\"\"))))","v":1},{"$f":"IF(OR(V16=\"\",X16=\"\"),\"\",IF(MAX(V16,X16)<3,\"\",SUMPRODUCT(--($V$13:V16>$X$13:X16),--(($V$13:V16>=3)+($X$13:X16>=3)>0))))","v":4},":",{"$f":"IF(OR(V16=\"\",X16=\"\"),\"\",IF(MAX(V16,X16)<3,\"\",SUMPRODUCT(--($X$13:X16>$V$13:V16),--(($V$13:V16>=3)+($X$13:X16>=3)>0))))","v":0}]
[null,null,null,null,null,null,null,null,null,null,null,null,null,null,null,null,null,null,null,null,null,{"$f":"IF(COUNTA(F17:T17)=0,\"\",_xlfn.LET(_xlpm.h,CHOOSE({1,2,3,4,5},F17,I17,L17,O17,R17),_xlpm.a,CHOOSE({1,2,3,4,5},H17,K17,N17,Q17,T17),SUM((_xlpm.h>_xlpm.a)*(_xlpm.h<>\"\")*(_xlpm.a<>\"\"))))","v":""},":",{"$f":"IF(COUNTA(F17:T17)=0,\"\",_xlfn.LET(_xlpm.h,CHOOSE({1,2,3,4,5},F17,I17,L17,O17,R17),_xlpm.a,CHOOSE({1,2,3,4,5},H17,K17,N17,Q17,T17),SUM((_xlpm.a>_xlpm.h)*(_xlpm.h<>\"\")*(_xlpm.a<>\"\"))))","v":""},{"$f":"IF(OR(V17=\"\",X17=\"\"),\"\",IF(MAX(V17,X17)<3,\"\",SUMPRODUCT(--($V$13:V17>$X$13:X17),--(($V$13:V17>=3)+($X$13:X17>=3)>0))))","v":""},":",{"$f":"IF(OR(V17=\"\",X17=\"\"),\"\",IF(MAX(V17,X17)<3,\"\",SUMPRODUCT(--($X$13:X17>$V$13:V17),--(($V$13:V17>=3)+($X$13:X17>=3)>0))))","v":""}]
[null,null,"A","Y",null,null,":",null,null,":",null,null,":",null,null,":",null,null,":",null,null,{"$f":"IF(COUNTA(F18:T18)=0,\"\",_xlfn.LET(_xlpm.h,CHOOSE({1,2,3,4,5},F18,I18,L18,O18,R18),_xlpm.a,CHOOSE({1,2,3,4,5},H18,K18,N18,Q18,T18),SUM((_xlpm.h>_xlpm.a)*(_xlpm.h<>\"\")*(_xlpm.a<>\"\"))))","v":0},":",{"$f":"IF(COUNTA(F18:T18)=0,\"\",_xlfn.LET(_xlpm.h,CHOOSE({1,2,3,4,5},F18,I18,L18,O18,R18),_xlpm.a,CHOOSE({1,2,3,4,5},H18,K18,N18,Q18,T18),SUM((_xlpm.a>_xlpm.h)*(_xlpm.h<>\"\")*(_xlpm.a<>\"\"))))","v":0},{"$f":"IF(OR(V18=\"\",X18=\"\"),\"\",IF(MAX(V18,X18)<3,\"\",SUMPRODUCT(--($V$13:V18>$X$13:X18),--(($V$13:V18>=3)+($X$13:X18>=3)>0))))","v":""},":",{"$f":"IF(OR(V18=\"\",X18=\"\"),\"\",IF(MAX(V18,X18)<3,\"\",SUMPRODUCT(--($X$13:X18>$V$13:V18),--(($V$13:V18>=3)+($X$13:X18>=3)>0))))","v":""}]
[null,null,"C","X",null,null,":",null,null,":",null,null,":",null,null,":",null,null,":",null,null,{"$f":"IF(COUNTA(F19:T19)=0,\"\",_xlfn.LET(_xlpm.h,CHOOSE({1,2,3,4,5},F19,I19,L19,O19,R19),_xlpm.a,CHOOSE({1,2,3,4,5},H19,K19,N19,Q19,T19),SUM((_xlpm.h>_xlpm.a)*(_xlpm.h<>\"\")*(_xlpm.a<>\"\"))))","v":0},":",{"$f":"IF(COUNTA(F19:T19)=0,\"\",_xlfn.LET(_xlpm.h,CHOOSE({1,2,3,4,5},F19,I19,L19,O19,R19),_xlpm.a,CHOOSE({1,2,3,4,5},H19,K19,N19,Q19,T19),SUM((_xlpm.a>_xlpm.h)*(_xlpm.h<>\"\")*(_xlpm.a<>\"\"))))","v":0},{"$f":"IF(OR(V19=\"\",X19=\"\"),\"\",IF(MAX(V19,X19)<3,\"\",SUMPRODUCT(--($V$13:V19>$X$13:X19),--(($V$13:V19>=3)+($X$13:X19>=3)>0))))","v":""},":",{"$f":"IF(OR(V19=\"\",X19=\"\"),\"\",IF(MAX(V19,X19)<3,\"\",SUMPRODUCT(--($X$13:X19>$V$13:V19),--(($V$13:V19>=3)+($X$13:X19>=3)>0))))","v":""}]
[null,null,"B","Z",null,null,":",null,null,":",null,null,":",null,null,":",null,null,":",null,null,{"$f":"IF(COUNTA(F20:T20)=0,\"\",_xlfn.LET(_xlpm.h,CHOOSE({1,2,3,4,5},F20,I20,L20,O20,R20),_xlpm.a,CHOOSE({1,2,3,4,5},H20,K20,N20,Q20,T20),SUM((_xlpm.h>_xlpm.a)*(_xlpm.h<>\"\")*(_xlpm.a<>\"\"))))","v":0},":",{"$f":"IF(COUNTA(F20:T20)=0,\"\",_xlfn.LET(_xlpm.h,CHOOSE({1,2,3,4,5},F20,I20,L20,O20,R20),_xlpm.a,CHOOSE({1,2,3,4,5},H20,K20,N20,Q20,T20),SUM((_xlpm.a>_xlpm.h)*(_xlpm.h<>\"\")*(_xlpm.a<>\"\"))))","v":0},{"$f":"IF(OR(V20=\"\",X20=\"\"),\"\",IF(MAX(V20,X20)<3,\"\",SUMPRODUCT(--($V$13:V20>$X$13:X20),--(($V$13:V20>=3)+($X$13:X20>=3)>0))))","v":""},":",{"$f":"IF(OR(V20=\"\",X20=\"\"),\"\",IF(MAX(V20,X20)<3,\"\",SUMPRODUCT(--($X$13:X20>$V$13:V20),--(($V$13:V20>=3)+($X$13:X20>=3)>0))))","v":""}]
[]
[null,{"$f":"B4","v":"ARENA FERRO"},":",null,{"$f":"E4","v":"VAL SHARK"},{"$f":"MAX(Y13:Y20)","v":4},":",{"$f":"MAX(AA13:AA20)","v":0}]
[null,null,null,null,"SETOVI",{"$f":"SUM(V13:V20)","v":12},":",{"$f":"SUM(X13:X20)","v":4}]
[null,null,null,null,"POENI",{"$f":"SUM(F13:F20, I13:I20, L13:L20, O13:O20, R13:R20)","v":162},":",{"$f":"SUM(H13:H20, K13:K20, N13:N20, Q13:Q20, T13:T20)","v":136}]

{"sheet":"ZAPISNIK_2_1","index":8,"n_rows":24,"n_cols":48,"rows_kept":24,"cut":false,"hidden":true,"merged":[[2,23,2,27],[0,0,0,27],[1,1,1,3],[1,4,1,8],[1,9,1,12],[1,13,1,18],[1,19,1,22],[1,23,1,27],[2,1,2,3],[2,4,2,8],[2,9,2,12],[2,13,2,18],[2,19,2,22]]}
["ŽUPANIJSKA LIGA STSIŽ 2025./2026",null,null,null,null,null,null,null,null,null,null,null,null,null,null,null,null,null,null,null,null,null,null,null,null,null,null,null,null,null,null,null,null,null,null,null,null,null,null,null,null,null,null,null,null,null,null,"EDIT"]
[null,"GRAD DOMAĆIN",null,null,"DVORANA",null,null,null,null,"KOLO",null,null,null,"DATUM",null,null,null,null,null,"SAT"]
[null,"KOROMAČNO",null,null,"Društveni dom Koromačno",null,null,null,null,"2.",null,null,null,"7. 10. 2025.",null,null,null,null,null,"18:00:00"]
["Domaćin","BROVINJE 2",null,"Gost","VAL SHARK"]
["A","BENAZIĆ Sandro",null,"X","HRVANOVIĆ Jasmin"]
["B","STIPIĆ Matea",null,"Y","INFANTOLINO Davide"]
["C","BASIACO Leonida",null,"Z","IVINIĆ Serđo",null,null,null,null,null," "]
["R1",null,null,"R1"]
["R2",null,null,"R2"]
[]
[null,"DOMAĆIN",null,null,"GOST"]
[null,"BROVINJE 2",null,null,"VAL SHARK"]
[null,"BENAZIĆ Sandro","A","X","HRVANOVIĆ Jasmin",6,":",11,11,":",9,8,":",11,9,":",11,null,":",null,null,{"$f":"IF(COUNTA(F13:T13)=0,\"\",_xlfn.LET(_xlpm.h,CHOOSE({1,2,3,4,5},F13,I13,L13,O13,R13),_xlpm.a,CHOOSE({1,2,3,4,5},H13,K13,N13,Q13,T13),SUM((_xlpm.h>_xlpm.a)*(_xlpm.h<>\"\")*(_xlpm.a<>\"\"))))","v":1},":",{"$f":"IF(COUNTA(F13:T13)=0,\"\",_xlfn.LET(_xlpm.h,CHOOSE({1,2,3,4,5},F13,I13,L13,O13,R13),_xlpm.a,CHOOSE({1,2,3,4,5},H13,K13,N13,Q13,T13),SUM((_xlpm.a>_xlpm.h)*(_xlpm.h<>\"\")*(_xlpm.a<>\"\"))))","v":3},{"$f":"IF(OR(V13=\"\",X13=\"\"),\"\",IF(MAX(V13,X13)<3,\"\",SUMPRODUCT(--($V$13:V13>$X$13:X13),--(($V$13:V13>=3)+($X$13:X13>=3)>0))))","v":0},":",{"$f":"IF(OR(V13=\"\",X13=\"\"),\"\",IF(MAX(V13,X13)<3,\"\",SUMPRODUCT(--($X$13:X13>$V$13:V13),--(($V$13:V13>=3)+($X$13:X13>=3)>0))))","v":1}]
[null,"STIPIĆ Matea","B","Y","INFANTOLINO Davide",8,":",11,2,":",11,7,":",11,null,":",null,null,":",null,null,{"$f":"IF(COUNTA(F14:T14)=0,\"\",_xlfn.LET(_xlpm.h,CHOOSE({1,2,3,4,5},F14,I14,L14,O14,R14),_xlpm.a,CHOOSE({1,2,3,4,5},H14,K14,N14,Q14,T14),SUM((_xlpm.h>_xlpm.a)*(_xlpm.h<>\"\")*(_xlpm.a<>\"\"))))","v":0},":",{"$f":"IF(COUNTA(F14:T14)=0,\"\",_xlfn.LET(_xlpm.h,CHOOSE({1,2,3,4,5},F14,I14,L14,O14,R14),_xlpm.a,CHOOSE({1,2,3,4,5},H14,K14,N14,Q14,T14),SUM((_xlpm.a>_xlpm.h)*(_xlpm.h<>\"\")*(_xlpm.a<>\"\"))))","v":3},{"$f":"IF(OR(V14=\"\",X14=\"\"),\"\",IF(MAX(V14,X14)<3,\"\",SUMPRODUCT(--($V$13:V14>$X$13:X14),--(($V$13:V14>=3)+($X$13:X14>=3)>0))))","v":0},":",{"$f":"IF(OR(V14=\"\",X14=\"\"),\"\",IF(MAX(V14,X14)<3,\"\",SUMPRODUCT(--($X$13:X14>$V$13:V14),--(($V$13:V14>=3)+($X$13:X14>=3)>0))))","v":2}]
[null,"BASIACO Leonida","C","Z","IVINIĆ Serđo",11,":",9,11,":",5,11,":",5,null,":",null,null,":",null,null,{"$f":"IF(COUNTA(F15:T15)=0,\"\",_xlfn.LET(_xlpm.h,CHOOSE({1,2,3,4,5},F15,I15,L15,O15,R15),_xlpm.a,CHOOSE({1,2,3,4,5},H15,K15,N15,Q15,T15),SUM((_xlpm.h>_xlpm.a)*(_xlpm.h<>\"\")*(_xlpm.a<>\"\"))))","v":3},":",{"$f":"IF(COUNTA(F15:T15)=0,\"\",_xlfn.LET(_xlpm.h,CHOOSE({1,2,3,4,5},F15,I15,L15,O15,R15),_xlpm.a,CHOOSE({1,2,3,4,5},H15,K15,N15,Q15,T15),SUM((_xlpm.a>_xlpm.h)*(_xlpm.h<>\"\")*(_xlpm.a<>\"\"))))","v":0},{"$f":"IF(OR(V15=\"\",X15=\"\"),\"\",IF(MAX(V15,X15)<3,\"\",SUMPRODUCT(--($V$13:V15>$X$13:X15),--(($V$13:V15>=3)+($X$13:X15>=3)>0))))","v":1},":",{"$f":"IF(OR(V15=\"\",X15=\"\"),\"\",IF(MAX(V15,X15)<3,\"\",SUMPRODUCT(--($X$13:X15>$V$13:V15),--(($V$13:V15>=3)+($X$13:X15>=3)>0))))","v":2}]
[null,"BENAZIĆ S., BASIACO L.","PAR","PAR","HRVANOVIĆ J., IVINIĆ S.",11,":",6,8,":",11,9,":",11,11,":",9,7,":",11,null,{"$f":"IF(COUNTA(F16:T16)=0,\"\",_xlfn.LET(_xlpm.h,CHOOSE({1,2,3,4,5},F16,I16,L16,O16,R16),_xlpm.a,CHOOSE({1,2,3,4,5},H16,K16,N16,Q16,T16),SUM((_xlpm.h>_xlpm.a)*(_xlpm.h<>\"\")*(_xlpm.a<>\"\"))))","v":2},":",{"$f":"IF(COUNTA(F16:T16)=0,\"\",_xlfn.LET(_xlpm.h,CHOOSE({1,2,3,4,5},F16,I16,L16,O16,R16),_xlpm.a,CHOOSE({1,2,3,4,5},H16,K16,N16,Q16,T16),SUM((_xlpm.a>_xlpm.h)*(_xlpm.h<>\"\")*(_xlpm.a<>\"\"))))","v":3},{"$f":"IF(OR(V16=\"\",X16=\"\"),\"\",IF(MAX(V16,X16)<3,\"\",SUMPRODUCT(--($V$13:V16>$X$13:X16),--(($V$13:V16>=3)+($X$13:X16>=3)>0))))","v":1},":",{"$f":"IF(OR(V16=\"\",X16=\"\"),\"\",IF(MAX(V16,X16)<3,\"\",SUMPRODUCT(--($X$13:X16>$V$13:V16),--(($V$13:V16>=3)+($X$13:X16>=3)>0))))","v":3}]
[null,null,null,null,null,null,":",null,null,":",null,null,":",null,null,":",null,null,":",null,null,{"$f":"IF(COUNTA(F17:T17)=0,\"\",_xlfn.LET(_xlpm.h,CHOOSE({1,2,3,4,5},F17,I17,L17,O17,R17),_xlpm.a,CHOOSE({1,2,3,4,5},H17,K17,N17,Q17,T17),SUM((_xlpm.h>_xlpm.a)*(_xlpm.h<>\"\")*(_xlpm.a<>\"\"))))","v":0},":",{"$f":"IF(COUNTA(F17:T17)=0,\"\",_xlfn.LET(_xlpm.h,CHOOSE({1,2,3,4,5},F17,I17,L17,O17,R17),_xlpm.a,CHOOSE({1,2,3,4,5},H17,K17,N17,Q17,T17),SUM((_xlpm.a>_xlpm.h)*(_xlpm.h<>\"\")*(_xlpm.a<>\"\"))))","v":0},{"$f":"IF(OR(V17=\"\",X17=\"\"),\"\",IF(MAX(V17,X17)<3,\"\",SUMPRODUCT(--($V$13:V17>$X$13:X17),--(($V$13:V17>=3)+($X$13:X17>=3)>0))))","v":""},":",{"$f":"IF(OR(V17=\"\",X17=\"\"),\"\",IF(MAX(V17,X17)<3,\"\",SUMPRODUCT(--($X$13:X17>$V$13:V17),--(($V$13:V17>=3)+($X$13:X17>=3)>0))))","v":""}]
[null,"BENAZIĆ Sandro","A","Y","INFANTOLINO Davide",11,":",9,12,":",14,7,":",11,9,":",11,null,":",null,null,{"$f":"IF(COUNTA(F18:T18)=0,\"\",_xlfn.LET(_xlpm.h,CHOOSE({1,2,3,4,5},F18,I18,L18,O18,R18),_xlpm.a,CHOOSE({1,2,3,4,5},H18,K18,N18,Q18,T18),SUM((_xlpm.h>_xlpm.a)*(_xlpm.h<>\"\")*(_xlpm.a<>\"\"))))","v":1},":",{"$f":"IF(COUNTA(F18:T18)=0,\"\",_xlfn.LET(_xlpm.h,CHOOSE({1,2,3,4,5},F18,I18,L18,O18,R18),_xlpm.a,CHOOSE({1,2,3,4,5},H18,K18,N18,Q18,T18),SUM((_xlpm.a>_xlpm.h)*(_xlpm.h<>\"\")*(_xlpm.a<>\"\"))))","v":3},{"$f":"IF(OR(V18=\"\",X18=\"\"),\"\",IF(MAX(V18,X18)<3,\"\",SUMPRODUCT(--($V$13:V18>$X$13:X18),--(($V$13:V18>=3)+($X$13:X18>=3)>0))))","v":1},":",{"$f":"IF(OR(V18=\"\",X18=\"\"),\"\",IF(MAX(V18,X18)<3,\"\",SUMPRODUCT(--($X$13:X18>$V$13:V18),--(($V$13:V18>=3)+($X$13:X18>=3)>0))))","v":4}]
[null,null,"C","X",null,null,":",null,null,":",null,null,":",null,null,":",null,null,":",null,null,{"$f":"IF(COUNTA(F19:T19)=0,\"\",_xlfn.LET(_xlpm.h,CHOOSE({1,2,3,4,5},F19,I19,L19,O19,R19),_xlpm.a,CHOOSE({1,2,3,4,5},H19,K19,N19,Q19,T19),SUM((_xlpm.h>_xlpm.a)*(_xlpm.h<>\"\")*(_xlpm.a<>\"\"))))","v":0},":",{"$f":"IF(COUNTA(F19:T19)=0,\"\",_xlfn.LET(_xlpm.h,CHOOSE({1,2,3,4,5},F19,I19,L19,O19,R19),_xlpm.a,CHOOSE({1,2,3,4,5},H19,K19,N19,Q19,T19),SUM((_xlpm.a>_xlpm.h)*(_xlpm.h<>\"\")*(_xlpm.a<>\"\"))))","v":0},{"$f":"IF(OR(V19=\"\",X19=\"\"),\"\",IF(MAX(V19,X19)<3,\"\",SUMPRODUCT(--($V$13:V19>$X$13:X19),--(($V$13:V19>=3)+($X$13:X19>=3)>0))))","v":""},":",{"$f":"IF(OR(V19=\"\",X19=\"\"),\"\",IF(MAX(V19,X19)<3,\"\",SUMPRODUCT(--($X$13:X19>$V$13:V19),--(($V$13:V19>=3)+($X$13:X19>=3)>0))))","v":""}]
[null,null,"B","Z",null,null,":",null,null,":",null,null,":",null,null,":",null,null,":",null,null,{"$f":"IF(COUNTA(F20:T20)=0,\"\",_xlfn.LET(_xlpm.h,CHOOSE({1,2,3,4,5},F20,I20,L20,O20,R20),_xlpm.a,CHOOSE({1,2,3,4,5},H20,K20,N20,Q20,T20),SUM((_xlpm.h>_xlpm.a)*(_xlpm.h<>\"\")*(_xlpm.a<>\"\"))))","v":0},":",{"$f":"IF(COUNTA(F20:T20)=0,\"\",_xlfn.LET(_xlpm.h,CHOOSE({1,2,3,4,5},F20,I20,L20,O20,R20),_xlpm.a,CHOOSE({1,2,3,4,5},H20,K20,N20,Q20,T20),SUM((_xlpm.a>_xlpm.h)*(_xlpm.h<>\"\")*(_xlpm.a<>\"\"))))","v":0},{"$f":"IF(OR(V20=\"\",X20=\"\"),\"\",IF(MAX(V20,X20)<3,\"\",SUMPRODUCT(--($V$13:V20>$X$13:X20),--(($V$13:V20>=3)+($X$13:X20>=3)>0))))","v":""},":",{"$f":"IF(OR(V20=\"\",X20=\"\"),\"\",IF(MAX(V20,X20)<3,\"\",SUMPRODUCT(--($X$13:X20>$V$13:V20),--(($V$13:V20>=3)+($X$13:X20>=3)>0))))","v":""}]
[]
[null,{"$f":"B4","v":"BROVINJE 2"},":",null,{"$f":"E4","v":"VAL SHARK"},{"$f":"MAX(Y13:Y20)","v":1},":",{"$f":"MAX(AA13:AA20)","v":4}]
[null,null,null,null,"SETOVI",{"$f":"SUM(V13:V20)","v":7},":",{"$f":"SUM(X13:X20)","v":12}]
[null,null,null,null,"POENI",{"$f":"SUM(F13:F20, I13:I20, L13:L20, O13:O20, R13:R20)","v":169},":",{"$f":"SUM(H13:H20, K13:K20, N13:N20, Q13:Q20, T13:T20)","v":187}]

{"sheet":"ZAPISNIK_2_2","index":9,"n_rows":24,"n_cols":48,"rows_kept":24,"cut":false,"hidden":true,"merged":[[2,23,2,27],[0,0,0,27],[1,1,1,3],[1,4,1,8],[1,9,1,12],[1,13,1,18],[1,19,1,22],[1,23,1,27],[2,1,2,3],[2,4,2,8],[2,9,2,12],[2,13,2,18],[2,19,2,22]]}
["ŽUPANIJSKA LIGA STSIŽ 2025./2026",null,null,null,null,null,null,null,null,null,null,null,null,null,null,null,null,null,null,null,null,null,null,null,null,null,null,null,null,null,null,null,null,null,null,null,null,null,null,null,null,null,null,null,null,null,null,"EDIT"]
[null,"GRAD DOMAĆIN",null,null,"DVORANA",null,null,null,null,"KOLO",null,null,null,"DATUM",null,null,null,null,null,"SAT"]
[null,"KOROMAČNO",null,null,"Društveni dom Koromačno",null,null,null,null,"2.",null,null,null,"7. 10. 2025.",null,null,null,null,null,"18:00:00"]
["Domaćin","BROVINJE 2",null,"Gost","ARENA FERRO"]
["A","BASIACO Leonida",null,"X","KRIŠTO Tomislav"]
["B","BENAZIĆ Sandro",null,"Y","CINKOPAN Kristijan"]
["C","GASPARI HUDOLETNJAK Matija",null,"Z","KELEMEN Mićo",null,null,null,null,null," "]
["R1",null,null,"R1"]
["R2",null,null,"R2"]
[]
[null,"DOMAĆIN",null,null,"GOST"]
[null,"BROVINJE 2",null,null,"ARENA FERRO"]
[null,"BASIACO Leonida","A","X","KRIŠTO Tomislav",11,":",5,11,":",5,11,":",9,null,":",null,null,":",null,null,{"$f":"IF(COUNTA(F13:T13)=0,\"\",_xlfn.LET(_xlpm.h,CHOOSE({1,2,3,4,5},F13,I13,L13,O13,R13),_xlpm.a,CHOOSE({1,2,3,4,5},H13,K13,N13,Q13,T13),SUM((_xlpm.h>_xlpm.a)*(_xlpm.h<>\"\")*(_xlpm.a<>\"\"))))","v":3},":",{"$f":"IF(COUNTA(F13:T13)=0,\"\",_xlfn.LET(_xlpm.h,CHOOSE({1,2,3,4,5},F13,I13,L13,O13,R13),_xlpm.a,CHOOSE({1,2,3,4,5},H13,K13,N13,Q13,T13),SUM((_xlpm.a>_xlpm.h)*(_xlpm.h<>\"\")*(_xlpm.a<>\"\"))))","v":0},{"$f":"IF(OR(V13=\"\",X13=\"\"),\"\",IF(MAX(V13,X13)<3,\"\",SUMPRODUCT(--($V$13:V13>$X$13:X13),--(($V$13:V13>=3)+($X$13:X13>=3)>0))))","v":1},":",{"$f":"IF(OR(V13=\"\",X13=\"\"),\"\",IF(MAX(V13,X13)<3,\"\",SUMPRODUCT(--($X$13:X13>$V$13:V13),--(($V$13:V13>=3)+($X$13:X13>=3)>0))))","v":0}]
[null,"BENAZIĆ Sandro","B","Y","CINKOPAN Kristijan",10,":",12,12,":",14,7,":",11,null,":",null,null,":",null,null,{"$f":"IF(COUNTA(F14:T14)=0,\"\",_xlfn.LET(_xlpm.h,CHOOSE({1,2,3,4,5},F14,I14,L14,O14,R14),_xlpm.a,CHOOSE({1,2,3,4,5},H14,K14,N14,Q14,T14),SUM((_xlpm.h>_xlpm.a)*(_xlpm.h<>\"\")*(_xlpm.a<>\"\"))))","v":0},":",{"$f":"IF(COUNTA(F14:T14)=0,\"\",_xlfn.LET(_xlpm.h,CHOOSE({1,2,3,4,5},F14,I14,L14,O14,R14),_xlpm.a,CHOOSE({1,2,3,4,5},H14,K14,N14,Q14,T14),SUM((_xlpm.a>_xlpm.h)*(_xlpm.h<>\"\")*(_xlpm.a<>\"\"))))","v":3},{"$f":"IF(OR(V14=\"\",X14=\"\"),\"\",IF(MAX(V14,X14)<3,\"\",SUMPRODUCT(--($V$13:V14>$X$13:X14),--(($V$13:V14>=3)+($X$13:X14>=3)>0))))","v":1},":",{"$f":"IF(OR(V14=\"\",X14=\"\"),\"\",IF(MAX(V14,X14)<3,\"\",SUMPRODUCT(--($X$13:X14>$V$13:V14),--(($V$13:V14>=3)+($X$13:X14>=3)>0))))","v":1}]
[null,"GASPARI HUDOLETNJAK Matija","C","Z","KELEMEN Mićo",10,":",12,11,":",2,11,":",8,11,":",8,null,":",null,null,{"$f":"IF(COUNTA(F15:T15)=0,\"\",_xlfn.LET(_xlpm.h,CHOOSE({1,2,3,4,5},F15,I15,L15,O15,R15),_xlpm.a,CHOOSE({1,2,3,4,5},H15,K15,N15,Q15,T15),SUM((_xlpm.h>_xlpm.a)*(_xlpm.h<>\"\")*(_xlpm.a<>\"\"))))","v":3},":",{"$f":"IF(COUNTA(F15:T15)=0,\"\",_xlfn.LET(_xlpm.h,CHOOSE({1,2,3,4,5},F15,I15,L15,O15,R15),_xlpm.a,CHOOSE({1,2,3,4,5},H15,K15,N15,Q15,T15),SUM((_xlpm.a>_xlpm.h)*(_xlpm.h<>\"\")*(_xlpm.a<>\"\"))))","v":1},{"$f":"IF(OR(V15=\"\",X15=\"\"),\"\",IF(MAX(V15,X15)<3,\"\",SUMPRODUCT(--($V$13:V15>$X$13:X15),--(($V$13:V15>=3)+($X$13:X15>=3)>0))))","v":2},":",{"$f":"IF(OR(V15=\"\",X15=\"\"),\"\",IF(MAX(V15,X15)<3,\"\",SUMPRODUCT(--($X$13:X15>$V$13:V15),--(($V$13:V15>=3)+($X$13:X15>=3)>0))))","v":1}]
[null,"BASIACO L., GASPARI HUDOLETNJAK","PAR","PAR","CINKOPAN K., KELEMEN M.",7,":",11,11,":",8,8,":",11,7,":",11,null,":",null,null,{"$f":"IF(COUNTA(F16:T16)=0,\"\",_xlfn.LET(_xlpm.h,CHOOSE({1,2,3,4,5},F16,I16,L16,O16,R16),_xlpm.a,CHOOSE({1,2,3,4,5},H16,K16,N16,Q16,T16),SUM((_xlpm.h>_xlpm.a)*(_xlpm.h<>\"\")*(_xlpm.a<>\"\"))))","v":1},":",{"$f":"IF(COUNTA(F16:T16)=0,\"\",_xlfn.LET(_xlpm.h,CHOOSE({1,2,3,4,5},F16,I16,L16,O16,R16),_xlpm.a,CHOOSE({1,2,3,4,5},H16,K16,N16,Q16,T16),SUM((_xlpm.a>_xlpm.h)*(_xlpm.h<>\"\")*(_xlpm.a<>\"\"))))","v":3},{"$f":"IF(OR(V16=\"\",X16=\"\"),\"\",IF(MAX(V16,X16)<3,\"\",SUMPRODUCT(--($V$13:V16>$X$13:X16),--(($V$13:V16>=3)+($X$13:X16>=3)>0))))","v":2},":",{"$f":"IF(OR(V16=\"\",X16=\"\"),\"\",IF(MAX(V16,X16)<3,\"\",SUMPRODUCT(--($X$13:X16>$V$13:V16),--(($V$13:V16>=3)+($X$13:X16>=3)>0))))","v":2}]
[null,null,null,null,null,null,":",null,null,":",null,null,":",null,null,":",null,null,":",null,null,{"$f":"IF(COUNTA(F17:T17)=0,\"\",_xlfn.LET(_xlpm.h,CHOOSE({1,2,3,4,5},F17,I17,L17,O17,R17),_xlpm.a,CHOOSE({1,2,3,4,5},H17,K17,N17,Q17,T17),SUM((_xlpm.h>_xlpm.a)*(_xlpm.h<>\"\")*(_xlpm.a<>\"\"))))","v":0},":",{"$f":"IF(COUNTA(F17:T17)=0,\"\",_xlfn.LET(_xlpm.h,CHOOSE({1,2,3,4,5},F17,I17,L17,O17,R17),_xlpm.a,CHOOSE({1,2,3,4,5},H17,K17,N17,Q17,T17),SUM((_xlpm.a>_xlpm.h)*(_xlpm.h<>\"\")*(_xlpm.a<>\"\"))))","v":0},{"$f":"IF(OR(V17=\"\",X17=\"\"),\"\",IF(MAX(V17,X17)<3,\"\",SUMPRODUCT(--($V$13:V17>$X$13:X17),--(($V$13:V17>=3)+($X$13:X17>=3)>0))))","v":""},":",{"$f":"IF(OR(V17=\"\",X17=\"\"),\"\",IF(MAX(V17,X17)<3,\"\",SUMPRODUCT(--($X$13:X17>$V$13:V17),--(($V$13:V17>=3)+($X$13:X17>=3)>0))))","v":""}]
[null,"BASIACO Leonida","A","Y","CINKOPAN Kristijan",11,":",8,11,":",8,9,":",11,7,":",11,11,":",7,null,{"$f":"IF(COUNTA(F18:T18)=0,\"\",_xlfn.LET(_xlpm.h,CHOOSE({1,2,3,4,5},F18,I18,L18,O18,R18),_xlpm.a,CHOOSE({1,2,3,4,5},H18,K18,N18,Q18,T18),SUM((_xlpm.h>_xlpm.a)*(_xlpm.h<>\"\")*(_xlpm.a<>\"\"))))","v":3},":",{"$f":"IF(COUNTA(F18:T18)=0,\"\",_xlfn.LET(_xlpm.h,CHOOSE({1,2,3,4,5},F18,I18,L18,O18,R18),_xlpm.a,CHOOSE({1,2,3,4,5},H18,K18,N18,Q18,T18),SUM((_xlpm.a>_xlpm.h)*(_xlpm.h<>\"\")*(_xlpm.a<>\"\"))))","v":2},{"$f":"IF(OR(V18=\"\",X18=\"\"),\"\",IF(MAX(V18,X18)<3,\"\",SUMPRODUCT(--($V$13:V18>$X$13:X18),--(($V$13:V18>=3)+($X$13:X18>=3)>0))))","v":3},":",{"$f":"IF(OR(V18=\"\",X18=\"\"),\"\",IF(MAX(V18,X18)<3,\"\",SUMPRODUCT(--($X$13:X18>$V$13:V18),--(($V$13:V18>=3)+($X$13:X18>=3)>0))))","v":2}]
[null,"GASPARI HUDOLETNJAK Matija","C","X","KRIŠTO Tomislav",11,":",8,11,":",8,6,":",11,6,":",11,11,":",7,null,{"$f":"IF(COUNTA(F19:T19)=0,\"\",_xlfn.LET(_xlpm.h,CHOOSE({1,2,3,4,5},F19,I19,L19,O19,R19),_xlpm.a,CHOOSE({1,2,3,4,5},H19,K19,N19,Q19,T19),SUM((_xlpm.h>_xlpm.a)*(_xlpm.h<>\"\")*(_xlpm.a<>\"\"))))","v":3},":",{"$f":"IF(COUNTA(F19:T19)=0,\"\",_xlfn.LET(_xlpm.h,CHOOSE({1,2,3,4,5},F19,I19,L19,O19,R19),_xlpm.a,CHOOSE({1,2,3,4,5},H19,K19,N19,Q19,T19),SUM((_xlpm.a>_xlpm.h)*(_xlpm.h<>\"\")*(_xlpm.a<>\"\"))))","v":2},{"$f":"IF(OR(V19=\"\",X19=\"\"),\"\",IF(MAX(V19,X19)<3,\"\",SUMPRODUCT(--($V$13:V19>$X$13:X19),--(($V$13:V19>=3)+($X$13:X19>=3)>0))))","v":4},":",{"$f":"IF(OR(V19=\"\",X19=\"\"),\"\",IF(MAX(V19,X19)<3,\"\",SUMPRODUCT(--($X$13:X19>$V$13:V19),--(($V$13:V19>=3)+($X$13:X19>=3)>0))))","v":2}]
[null,null,"B","Z",null,null,":",null,null,":",null,null,":",null,null,":",null,null,":",null,null,{"$f":"IF(COUNTA(F20:T20)=0,\"\",_xlfn.LET(_xlpm.h,CHOOSE({1,2,3,4,5},F20,I20,L20,O20,R20),_xlpm.a,CHOOSE({1,2,3,4,5},H20,K20,N20,Q20,T20),SUM((_xlpm.h>_xlpm.a)*(_xlpm.h<>\"\")*(_xlpm.a<>\"\"))))","v":0},":",{"$f":"IF(COUNTA(F20:T20)=0,\"\",_xlfn.LET(_xlpm.h,CHOOSE({1,2,3,4,5},F20,I20,L20,O20,R20),_xlpm.a,CHOOSE({1,2,3,4,5},H20,K20,N20,Q20,T20),SUM((_xlpm.a>_xlpm.h)*(_xlpm.h<>\"\")*(_xlpm.a<>\"\"))))","v":0},{"$f":"IF(OR(V20=\"\",X20=\"\"),\"\",IF(MAX(V20,X20)<3,\"\",SUMPRODUCT(--($V$13:V20>$X$13:X20),--(($V$13:V20>=3)+($X$13:X20>=3)>0))))","v":""},":",{"$f":"IF(OR(V20=\"\",X20=\"\"),\"\",IF(MAX(V20,X20)<3,\"\",SUMPRODUCT(--($X$13:X20>$V$13:V20),--(($V$13:V20>=3)+($X$13:X20>=3)>0))))","v":""}]
[]
[null,{"$f":"B4","v":"BROVINJE 2"},":",null,{"$f":"E4","v":"ARENA FERRO"},{"$f":"MAX(Y13:Y20)","v":4},":",{"$f":"MAX(AA13:AA20)","v":2}]
[null,null,null,null,"SETOVI",{"$f":"SUM(V13:V20)","v":13},":",{"$f":"SUM(X13:X20)","v":11}]
[null,null,null,null,"POENI",{"$f":"SUM(F13:F20, I13:I20, L13:L20, O13:O20, R13:R20)","v":232},":",{"$f":"SUM(H13:H20, K13:K20, N13:N20, Q13:Q20, T13:T20)","v":217}]

{"sheet":"ZAPISNIK_2_3","index":10,"n_rows":24,"n_cols":48,"rows_kept":24,"cut":false,"hidden":true,"merged":[[2,23,2,27],[0,0,0,27],[1,1,1,3],[1,4,1,8],[1,9,1,12],[1,13,1,18],[1,19,1,22],[1,23,1,27],[2,1,2,3],[2,4,2,8],[2,9,2,12],[2,13,2,18],[2,19,2,22]]}
["ŽUPANIJSKA LIGA STSIŽ 2025./2026",null,null,null,null,null,null,null,null,null,null,null,null,null,null,null,null,null,null,null,null,null,null,null,null,null,null,null,null,null,null,null,null,null,null,null,null,null,null,null,null,null,null,null,null,null,null,"EDIT"]
[null,"GRAD DOMAĆIN",null,null,"DVORANA",null,null,null,null,"KOLO",null,null,null,"DATUM",null,null,null,null,null,"SAT"]
[null,"PAZIN",null,null,"Sportska dvorana Pazin",null,null,null,null,"2.",null,null,null,"25. 10. 2025.",null,null,null,null,null,"10:30:00"]
["Domaćin","PAZIN",null,"Gost","BUZET 2"]
["A","FABIJAN Damir",null,"X","DRAŠĆIĆ Petar"]
["B","FABRIS Karlo",null,"Y","PAVLETIĆ Guido"]
["C","GLAVINIĆ Denis",null,"Z","BOŠNJAKOVIĆ Dubravko",null,null,null,null,null," "]
["R1",null,null,"R1"]
["R2",null,null,"R2"]
[]
[null,"DOMAĆIN",null,null,"GOST"]
[null,"PAZIN",null,null,"BUZET 2"]
[null,"FABIJAN Damir","A","X","DRAŠĆIĆ Petar",3,":",11,4,":",11,7,":",11,null,":",null,null,":",null,null,{"$f":"IF(COUNTA(F13:T13)=0,\"\",_xlfn.LET(_xlpm.h,CHOOSE({1,2,3,4,5},F13,I13,L13,O13,R13),_xlpm.a,CHOOSE({1,2,3,4,5},H13,K13,N13,Q13,T13),SUM((_xlpm.h>_xlpm.a)*(_xlpm.h<>\"\")*(_xlpm.a<>\"\"))))","v":0},":",{"$f":"IF(COUNTA(F13:T13)=0,\"\",_xlfn.LET(_xlpm.h,CHOOSE({1,2,3,4,5},F13,I13,L13,O13,R13),_xlpm.a,CHOOSE({1,2,3,4,5},H13,K13,N13,Q13,T13),SUM((_xlpm.a>_xlpm.h)*(_xlpm.h<>\"\")*(_xlpm.a<>\"\"))))","v":3},{"$f":"IF(OR(V13=\"\",X13=\"\"),\"\",IF(MAX(V13,X13)<3,\"\",SUMPRODUCT(--($V$13:V13>$X$13:X13),--(($V$13:V13>=3)+($X$13:X13>=3)>0))))","v":0},":",{"$f":"IF(OR(V13=\"\",X13=\"\"),\"\",IF(MAX(V13,X13)<3,\"\",SUMPRODUCT(--($X$13:X13>$V$13:V13),--(($V$13:V13>=3)+($X$13:X13>=3)>0))))","v":1}]
[null,"FABRIS Karlo","B","Y","PAVLETIĆ Guido",11,":",1,11,":",6,11,":",6,null,":",null,null,":",null,null,{"$f":"IF(COUNTA(F14:T14)=0,\"\",_xlfn.LET(_xlpm.h,CHOOSE({1,2,3,4,5},F14,I14,L14,O14,R14),_xlpm.a,CHOOSE({1,2,3,4,5},H14,K14,N14,Q14,T14),SUM((_xlpm.h>_xlpm.a)*(_xlpm.h<>\"\")*(_xlpm.a<>\"\"))))","v":3},":",{"$f":"IF(COUNTA(F14:T14)=0,\"\",_xlfn.LET(_xlpm.h,CHOOSE({1,2,3,4,5},F14,I14,L14,O14,R14),_xlpm.a,CHOOSE({1,2,3,4,5},H14,K14,N14,Q14,T14),SUM((_xlpm.a>_xlpm.h)*(_xlpm.h<>\"\")*(_xlpm.a<>\"\"))))","v":0},{"$f":"IF(OR(V14=\"\",X14=\"\"),\"\",IF(MAX(V14,X14)<3,\"\",SUMPRODUCT(--($V$13:V14>$X$13:X14),--(($V$13:V14>=3)+($X$13:X14>=3)>0))))","v":1},":",{"$f":"IF(OR(V14=\"\",X14=\"\"),\"\",IF(MAX(V14,X14)<3,\"\",SUMPRODUCT(--($X$13:X14>$V$13:V14),--(($V$13:V14>=3)+($X$13:X14>=3)>0))))","v":1}]
[null,"GLAVINIĆ Denis","C","Z","BOŠNJAKOVIĆ Dubravko",11,":",3,11,":",4,11,":",4,null,":",null,null,":",null,null,{"$f":"IF(COUNTA(F15:T15)=0,\"\",_xlfn.LET(_xlpm.h,CHOOSE({1,2,3,4,5},F15,I15,L15,O15,R15),_xlpm.a,CHOOSE({1,2,3,4,5},H15,K15,N15,Q15,T15),SUM((_xlpm.h>_xlpm.a)*(_xlpm.h<>\"\")*(_xlpm.a<>\"\"))))","v":3},":",{"$f":"IF(COUNTA(F15:T15)=0,\"\",_xlfn.LET(_xlpm.h,CHOOSE({1,2,3,4,5},F15,I15,L15,O15,R15),_xlpm.a,CHOOSE({1,2,3,4,5},H15,K15,N15,Q15,T15),SUM((_xlpm.a>_xlpm.h)*(_xlpm.h<>\"\")*(_xlpm.a<>\"\"))))","v":0},{"$f":"IF(OR(V15=\"\",X15=\"\"),\"\",IF(MAX(V15,X15)<3,\"\",SUMPRODUCT(--($V$13:V15>$X$13:X15),--(($V$13:V15>=3)+($X$13:X15>=3)>0))))","v":2},":",{"$f":"IF(OR(V15=\"\",X15=\"\"),\"\",IF(MAX(V15,X15)<3,\"\",SUMPRODUCT(--($X$13:X15>$V$13:V15),--(($V$13:V15>=3)+($X$13:X15>=3)>0))))","v":1}]
[null,"GLAVINIĆ D., LUKEZ G.","PAR","PAR","DRAŠĆIĆ P., PAVLETIĆ G.",11,":",8,11,":",7,11,":",5,null,":",null,null,":",null,null,{"$f":"IF(COUNTA(F16:T16)=0,\"\",_xlfn.LET(_xlpm.h,CHOOSE({1,2,3,4,5},F16,I16,L16,O16,R16),_xlpm.a,CHOOSE({1,2,3,4,5},H16,K16,N16,Q16,T16),SUM((_xlpm.h>_xlpm.a)*(_xlpm.h<>\"\")*(_xlpm.a<>\"\"))))","v":3},":",{"$f":"IF(COUNTA(F16:T16)=0,\"\",_xlfn.LET(_xlpm.h,CHOOSE({1,2,3,4,5},F16,I16,L16,O16,R16),_xlpm.a,CHOOSE({1,2,3,4,5},H16,K16,N16,Q16,T16),SUM((_xlpm.a>_xlpm.h)*(_xlpm.h<>\"\")*(_xlpm.a<>\"\"))))","v":0},{"$f":"IF(OR(V16=\"\",X16=\"\"),\"\",IF(MAX(V16,X16)<3,\"\",SUMPRODUCT(--($V$13:V16>$X$13:X16),--(($V$13:V16>=3)+($X$13:X16>=3)>0))))","v":3},":",{"$f":"IF(OR(V16=\"\",X16=\"\"),\"\",IF(MAX(V16,X16)<3,\"\",SUMPRODUCT(--($X$13:X16>$V$13:V16),--(($V$13:V16>=3)+($X$13:X16>=3)>0))))","v":1}]
[null,null,null,null,null,null,":",null,null,":",null,null,":",null,null,":",null,null,":",null,null,{"$f":"IF(COUNTA(F17:T17)=0,\"\",_xlfn.LET(_xlpm.h,CHOOSE({1,2,3,4,5},F17,I17,L17,O17,R17),_xlpm.a,CHOOSE({1,2,3,4,5},H17,K17,N17,Q17,T17),SUM((_xlpm.h>_xlpm.a)*(_xlpm.h<>\"\")*(_xlpm.a<>\"\"))))","v":0},":",{"$f":"IF(COUNTA(F17:T17)=0,\"\",_xlfn.LET(_xlpm.h,CHOOSE({1,2,3,4,5},F17,I17,L17,O17,R17),_xlpm.a,CHOOSE({1,2,3,4,5},H17,K17,N17,Q17,T17),SUM((_xlpm.a>_xlpm.h)*(_xlpm.h<>\"\")*(_xlpm.a<>\"\"))))","v":0},{"$f":"IF(OR(V17=\"\",X17=\"\"),\"\",IF(MAX(V17,X17)<3,\"\",SUMPRODUCT(--($V$13:V17>$X$13:X17),--(($V$13:V17>=3)+($X$13:X17>=3)>0))))","v":""},":",{"$f":"IF(OR(V17=\"\",X17=\"\"),\"\",IF(MAX(V17,X17)<3,\"\",SUMPRODUCT(--($X$13:X17>$V$13:V17),--(($V$13:V17>=3)+($X$13:X17>=3)>0))))","v":""}]
[null,"FABIJAN Damir","A","Y","PAVLETIĆ Guido",9,":",11,6,":",11,12,":",10,11,":",5,11,":",9,null,{"$f":"IF(COUNTA(F18:T18)=0,\"\",_xlfn.LET(_xlpm.h,CHOOSE({1,2,3,4,5},F18,I18,L18,O18,R18),_xlpm.a,CHOOSE({1,2,3,4,5},H18,K18,N18,Q18,T18),SUM((_xlpm.h>_xlpm.a)*(_xlpm.h<>\"\")*(_xlpm.a<>\"\"))))","v":3},":",{"$f":"IF(COUNTA(F18:T18)=0,\"\",_xlfn.LET(_xlpm.h,CHOOSE({1,2,3,4,5},F18,I18,L18,O18,R18),_xlpm.a,CHOOSE({1,2,3,4,5},H18,K18,N18,Q18,T18),SUM((_xlpm.a>_xlpm.h)*(_xlpm.h<>\"\")*(_xlpm.a<>\"\"))))","v":2},{"$f":"IF(OR(V18=\"\",X18=\"\"),\"\",IF(MAX(V18,X18)<3,\"\",SUMPRODUCT(--($V$13:V18>$X$13:X18),--(($V$13:V18>=3)+($X$13:X18>=3)>0))))","v":4},":",{"$f":"IF(OR(V18=\"\",X18=\"\"),\"\",IF(MAX(V18,X18)<3,\"\",SUMPRODUCT(--($X$13:X18>$V$13:V18),--(($V$13:V18>=3)+($X$13:X18>=3)>0))))","v":1}]
[null,null,"C","X",null,null,":",null,null,":",null,null,":",null,null,":",null,null,":",null,null,{"$f":"IF(COUNTA(F19:T19)=0,\"\",_xlfn.LET(_xlpm.h,CHOOSE({1,2,3,4,5},F19,I19,L19,O19,R19),_xlpm.a,CHOOSE({1,2,3,4,5},H19,K19,N19,Q19,T19),SUM((_xlpm.h>_xlpm.a)*(_xlpm.h<>\"\")*(_xlpm.a<>\"\"))))","v":0},":",{"$f":"IF(COUNTA(F19:T19)=0,\"\",_xlfn.LET(_xlpm.h,CHOOSE({1,2,3,4,5},F19,I19,L19,O19,R19),_xlpm.a,CHOOSE({1,2,3,4,5},H19,K19,N19,Q19,T19),SUM((_xlpm.a>_xlpm.h)*(_xlpm.h<>\"\")*(_xlpm.a<>\"\"))))","v":0},{"$f":"IF(OR(V19=\"\",X19=\"\"),\"\",IF(MAX(V19,X19)<3,\"\",SUMPRODUCT(--($V$13:V19>$X$13:X19),--(($V$13:V19>=3)+($X$13:X19>=3)>0))))","v":""},":",{"$f":"IF(OR(V19=\"\",X19=\"\"),\"\",IF(MAX(V19,X19)<3,\"\",SUMPRODUCT(--($X$13:X19>$V$13:V19),--(($V$13:V19>=3)+($X$13:X19>=3)>0))))","v":""}]
[null,null,"B","Z",null,null,":",null,null,":",null,null,":",null,null,":",null,null,":",null,null,{"$f":"IF(COUNTA(F20:T20)=0,\"\",_xlfn.LET(_xlpm.h,CHOOSE({1,2,3,4,5},F20,I20,L20,O20,R20),_xlpm.a,CHOOSE({1,2,3,4,5},H20,K20,N20,Q20,T20),SUM((_xlpm.h>_xlpm.a)*(_xlpm.h<>\"\")*(_xlpm.a<>\"\"))))","v":0},":",{"$f":"IF(COUNTA(F20:T20)=0,\"\",_xlfn.LET(_xlpm.h,CHOOSE({1,2,3,4,5},F20,I20,L20,O20,R20),_xlpm.a,CHOOSE({1,2,3,4,5},H20,K20,N20,Q20,T20),SUM((_xlpm.a>_xlpm.h)*(_xlpm.h<>\"\")*(_xlpm.a<>\"\"))))","v":0},{"$f":"IF(OR(V20=\"\",X20=\"\"),\"\",IF(MAX(V20,X20)<3,\"\",SUMPRODUCT(--($V$13:V20>$X$13:X20),--(($V$13:V20>=3)+($X$13:X20>=3)>0))))","v":""},":",{"$f":"IF(OR(V20=\"\",X20=\"\"),\"\",IF(MAX(V20,X20)<3,\"\",SUMPRODUCT(--($X$13:X20>$V$13:V20),--(($V$13:V20>=3)+($X$13:X20>=3)>0))))","v":""}]
[]
[null,{"$f":"B4","v":"PAZIN"},":",null,{"$f":"E4","v":"BUZET 2"},{"$f":"MAX(Y13:Y20)","v":4},":",{"$f":"MAX(AA13:AA20)","v":1}]
[null,null,null,null,"SETOVI",{"$f":"SUM(V13:V20)","v":12},":",{"$f":"SUM(X13:X20)","v":5}]
[null,null,null,null,"POENI",{"$f":"SUM(F13:F20, I13:I20, L13:L20, O13:O20, R13:R20)","v":162},":",{"$f":"SUM(H13:H20, K13:K20, N13:N20, Q13:Q20, T13:T20)","v":123}]

{"sheet":"ZAPISNIK_2_4","index":11,"n_rows":24,"n_cols":48,"rows_kept":24,"cut":false,"hidden":true,"merged":[[2,23,2,27],[0,0,0,27],[1,1,1,3],[1,4,1,8],[1,9,1,12],[1,13,1,18],[1,19,1,22],[1,23,1,27],[2,1,2,3],[2,4,2,8],[2,9,2,12],[2,13,2,18],[2,19,2,22]]}
["ŽUPANIJSKA LIGA STSIŽ 2025./2026",null,null,null,null,null,null,null,null,null,null,null,null,null,null,null,null,null,null,null,null,null,null,null,null,null,null,null,null,null,null,null,null,null,null,null,null,null,null,null,null,null,null,null,null,null,null,"EDIT"]
[null,"GRAD DOMAĆIN",null,null,"DVORANA",null,null,null,null,"KOLO",null,null,null,"DATUM",null,null,null,null,null,"SAT"]
[null,"PAZIN",null,null,"Sportska dvorana Pazin",null,null,null,null,"2.",null,null,null,"25. 10. 2025.",null,null,null,null,null,"12:00:00"]
["Domaćin","PAZIN",null,"Gost","BUZET 1"]
["A","GLAVINIĆ Denis",null,"X","SIROTIĆ Aleš"]
["B","LUKEZ Goran",null,"Y","KRANČIĆ Filip"]
["C","FABRIS Karlo",null,"Z","BERDNYK Stanislav",null,null,null,null,null," "]
["R1",null,null,"R1"]
["R2",null,null,"R2"]
[]
[null,"DOMAĆIN",null,null,"GOST"]
[null,"PAZIN",null,null,"BUZET 1"]
[null,"GLAVINIĆ Denis","A","X","SIROTIĆ Aleš",11,":",1,11,":",1,11,":",9,null,":",null,null,":",null,null,{"$f":"IF(COUNTA(F13:T13)=0,\"\",_xlfn.LET(_xlpm.h,CHOOSE({1,2,3,4,5},F13,I13,L13,O13,R13),_xlpm.a,CHOOSE({1,2,3,4,5},H13,K13,N13,Q13,T13),SUM((_xlpm.h>_xlpm.a)*(_xlpm.h<>\"\")*(_xlpm.a<>\"\"))))","v":3},":",{"$f":"IF(COUNTA(F13:T13)=0,\"\",_xlfn.LET(_xlpm.h,CHOOSE({1,2,3,4,5},F13,I13,L13,O13,R13),_xlpm.a,CHOOSE({1,2,3,4,5},H13,K13,N13,Q13,T13),SUM((_xlpm.a>_xlpm.h)*(_xlpm.h<>\"\")*(_xlpm.a<>\"\"))))","v":0},{"$f":"IF(OR(V13=\"\",X13=\"\"),\"\",IF(MAX(V13,X13)<3,\"\",SUMPRODUCT(--($V$13:V13>$X$13:X13),--(($V$13:V13>=3)+($X$13:X13>=3)>0))))","v":1},":",{"$f":"IF(OR(V13=\"\",X13=\"\"),\"\",IF(MAX(V13,X13)<3,\"\",SUMPRODUCT(--($X$13:X13>$V$13:V13),--(($V$13:V13>=3)+($X$13:X13>=3)>0))))","v":0}]
[null,"LUKEZ Goran","B","Y","KRANČIĆ Filip",11,":",6,11,":",6,3,":",11,6,":",11,12,":",10,null,{"$f":"IF(COUNTA(F14:T14)=0,\"\",_xlfn.LET(_xlpm.h,CHOOSE({1,2,3,4,5},F14,I14,L14,O14,R14),_xlpm.a,CHOOSE({1,2,3,4,5},H14,K14,N14,Q14,T14),SUM((_xlpm.h>_xlpm.a)*(_xlpm.h<>\"\")*(_xlpm.a<>\"\"))))","v":3},":",{"$f":"IF(COUNTA(F14:T14)=0,\"\",_xlfn.LET(_xlpm.h,CHOOSE({1,2,3,4,5},F14,I14,L14,O14,R14),_xlpm.a,CHOOSE({1,2,3,4,5},H14,K14,N14,Q14,T14),SUM((_xlpm.a>_xlpm.h)*(_xlpm.h<>\"\")*(_xlpm.a<>\"\"))))","v":2},{"$f":"IF(OR(V14=\"\",X14=\"\"),\"\",IF(MAX(V14,X14)<3,\"\",SUMPRODUCT(--($V$13:V14>$X$13:X14),--(($V$13:V14>=3)+($X$13:X14>=3)>0))))","v":2},":",{"$f":"IF(OR(V14=\"\",X14=\"\"),\"\",IF(MAX(V14,X14)<3,\"\",SUMPRODUCT(--($X$13:X14>$V$13:V14),--(($V$13:V14>=3)+($X$13:X14>=3)>0))))","v":0}]
[null,"FABRIS Karlo","C","Z","BERDNYK Stanislav",11,":",8,11,":",6,11,":",6,null,":",null,null,":",null,null,{"$f":"IF(COUNTA(F15:T15)=0,\"\",_xlfn.LET(_xlpm.h,CHOOSE({1,2,3,4,5},F15,I15,L15,O15,R15),_xlpm.a,CHOOSE({1,2,3,4,5},H15,K15,N15,Q15,T15),SUM((_xlpm.h>_xlpm.a)*(_xlpm.h<>\"\")*(_xlpm.a<>\"\"))))","v":3},":",{"$f":"IF(COUNTA(F15:T15)=0,\"\",_xlfn.LET(_xlpm.h,CHOOSE({1,2,3,4,5},F15,I15,L15,O15,R15),_xlpm.a,CHOOSE({1,2,3,4,5},H15,K15,N15,Q15,T15),SUM((_xlpm.a>_xlpm.h)*(_xlpm.h<>\"\")*(_xlpm.a<>\"\"))))","v":0},{"$f":"IF(OR(V15=\"\",X15=\"\"),\"\",IF(MAX(V15,X15)<3,\"\",SUMPRODUCT(--($V$13:V15>$X$13:X15),--(($V$13:V15>=3)+($X$13:X15>=3)>0))))","v":3},":",{"$f":"IF(OR(V15=\"\",X15=\"\"),\"\",IF(MAX(V15,X15)<3,\"\",SUMPRODUCT(--($X$13:X15>$V$13:V15),--(($V$13:V15>=3)+($X$13:X15>=3)>0))))","v":0}]
[null,"GLAVINIĆ D., LUKEZ G.","PAR","PAR","SIROTIĆ A., KRANČIĆ F.",11,":",6,7,":",11,12,":",14,2,":",11,null,":",null,null,{"$f":"IF(COUNTA(F16:T16)=0,\"\",_xlfn.LET(_xlpm.h,CHOOSE({1,2,3,4,5},F16,I16,L16,O16,R16),_xlpm.a,CHOOSE({1,2,3,4,5},H16,K16,N16,Q16,T16),SUM((_xlpm.h>_xlpm.a)*(_xlpm.h<>\"\")*(_xlpm.a<>\"\"))))","v":1},":",{"$f":"IF(COUNTA(F16:T16)=0,\"\",_xlfn.LET(_xlpm.h,CHOOSE({1,2,3,4,5},F16,I16,L16,O16,R16),_xlpm.a,CHOOSE({1,2,3,4,5},H16,K16,N16,Q16,T16),SUM((_xlpm.a>_xlpm.h)*(_xlpm.h<>\"\")*(_xlpm.a<>\"\"))))","v":3},{"$f":"IF(OR(V16=\"\",X16=\"\"),\"\",IF(MAX(V16,X16)<3,\"\",SUMPRODUCT(--($V$13:V16>$X$13:X16),--(($V$13:V16>=3)+($X$13:X16>=3)>0))))","v":3},":",{"$f":"IF(OR(V16=\"\",X16=\"\"),\"\",IF(MAX(V16,X16)<3,\"\",SUMPRODUCT(--($X$13:X16>$V$13:V16),--(($V$13:V16>=3)+($X$13:X16>=3)>0))))","v":1}]
[null,null,null,null,null,null,":",null,null,":",null,null,":",null,null,":",null,null,":",null,null,{"$f":"IF(COUNTA(F17:T17)=0,\"\",_xlfn.LET(_xlpm.h,CHOOSE({1,2,3,4,5},F17,I17,L17,O17,R17),_xlpm.a,CHOOSE({1,2,3,4,5},H17,K17,N17,Q17,T17),SUM((_xlpm.h>_xlpm.a)*(_xlpm.h<>\"\")*(_xlpm.a<>\"\"))))","v":0},":",{"$f":"IF(COUNTA(F17:T17)=0,\"\",_xlfn.LET(_xlpm.h,CHOOSE({1,2,3,4,5},F17,I17,L17,O17,R17),_xlpm.a,CHOOSE({1,2,3,4,5},H17,K17,N17,Q17,T17),SUM((_xlpm.a>_xlpm.h)*(_xlpm.h<>\"\")*(_xlpm.a<>\"\"))))","v":0},{"$f":"IF(OR(V17=\"\",X17=\"\"),\"\",IF(MAX(V17,X17)<3,\"\",SUMPRODUCT(--($V$13:V17>$X$13:X17),--(($V$13:V17>=3)+($X$13:X17>=3)>0))))","v":""},":",{"$f":"IF(OR(V17=\"\",X17=\"\"),\"\",IF(MAX(V17,X17)<3,\"\",SUMPRODUCT(--($X$13:X17>$V$13:V17),--(($V$13:V17>=3)+($X$13:X17>=3)>0))))","v":""}]
[null,"GLAVINIĆ Denis","A","Y","KRANČIĆ Filip",11,":",1,11,":",6,3,":",11,11,":",8,null,":",null,null,{"$f":"IF(COUNTA(F18:T18)=0,\"\",_xlfn.LET(_xlpm.h,CHOOSE({1,2,3,4,5},F18,I18,L18,O18,R18),_xlpm.a,CHOOSE({1,2,3,4,5},H18,K18,N18,Q18,T18),SUM((_xlpm.h>_xlpm.a)*(_xlpm.h<>\"\")*(_xlpm.a<>\"\"))))","v":3},":",{"$f":"IF(COUNTA(F18:T18)=0,\"\",_xlfn.LET(_xlpm.h,CHOOSE({1,2,3,4,5},F18,I18,L18,O18,R18),_xlpm.a,CHOOSE({1,2,3,4,5},H18,K18,N18,Q18,T18),SUM((_xlpm.a>_xlpm.h)*(_xlpm.h<>\"\")*(_xlpm.a<>\"\"))))","v":1},{"$f":"IF(OR(V18=\"\",X18=\"\"),\"\",IF(MAX(V18,X18)<3,\"\",SUMPRODUCT(--($V$13:V18>$X$13:X18),--(($V$13:V18>=3)+($X$13:X18>=3)>0))))","v":4},":",{"$f":"IF(OR(V18=\"\",X18=\"\"),\"\",IF(MAX(V18,X18)<3,\"\",SUMPRODUCT(--($X$13:X18>$V$13:V18),--(($V$13:V18>=3)+($X$13:X18>=3)>0))))","v":1}]
[null,null,"C","X",null,null,":",null,null,":",null,null,":",null,null,":",null,null,":",null,null,{"$f":"IF(COUNTA(F19:T19)=0,\"\",_xlfn.LET(_xlpm.h,CHOOSE({1,2,3,4,5},F19,I19,L19,O19,R19),_xlpm.a,CHOOSE({1,2,3,4,5},H19,K19,N19,Q19,T19),SUM((_xlpm.h>_xlpm.a)*(_xlpm.h<>\"\")*(_xlpm.a<>\"\"))))","v":0},":",{"$f":"IF(COUNTA(F19:T19)=0,\"\",_xlfn.LET(_xlpm.h,CHOOSE({1,2,3,4,5},F19,I19,L19,O19,R19),_xlpm.a,CHOOSE({1,2,3,4,5},H19,K19,N19,Q19,T19),SUM((_xlpm.a>_xlpm.h)*(_xlpm.h<>\"\")*(_xlpm.a<>\"\"))))","v":0},{"$f":"IF(OR(V19=\"\",X19=\"\"),\"\",IF(MAX(V19,X19)<3,\"\",SUMPRODUCT(--($V$13:V19>$X$13:X19),--(($V$13:V19>=3)+($X$13:X19>=3)>0))))","v":""},":",{"$f":"IF(OR(V19=\"\",X19=\"\"),\"\",IF(MAX(V19,X19)<3,\"\",SUMPRODUCT(--($X$13:X19>$V$13:V19),--(($V$13:V19>=3)+($X$13:X19>=3)>0))))","v":""}]
[null,null,"B","Z",null,null,":",null,null,":",null,null,":",null,null,":",null,null,":",null,null,{"$f":"IF(COUNTA(F20:T20)=0,\"\",_xlfn.LET(_xlpm.h,CHOOSE({1,2,3,4,5},F20,I20,L20,O20,R20),_xlpm.a,CHOOSE({1,2,3,4,5},H20,K20,N20,Q20,T20),SUM((_xlpm.h>_xlpm.a)*(_xlpm.h<>\"\")*(_xlpm.a<>\"\"))))","v":0},":",{"$f":"IF(COUNTA(F20:T20)=0,\"\",_xlfn.LET(_xlpm.h,CHOOSE({1,2,3,4,5},F20,I20,L20,O20,R20),_xlpm.a,CHOOSE({1,2,3,4,5},H20,K20,N20,Q20,T20),SUM((_xlpm.a>_xlpm.h)*(_xlpm.h<>\"\")*(_xlpm.a<>\"\"))))","v":0},{"$f":"IF(OR(V20=\"\",X20=\"\"),\"\",IF(MAX(V20,X20)<3,\"\",SUMPRODUCT(--($V$13:V20>$X$13:X20),--(($V$13:V20>=3)+($X$13:X20>=3)>0))))","v":""},":",{"$f":"IF(OR(V20=\"\",X20=\"\"),\"\",IF(MAX(V20,X20)<3,\"\",SUMPRODUCT(--($X$13:X20>$V$13:V20),--(($V$13:V20>=3)+($X$13:X20>=3)>0))))","v":""}]
[]
[null,{"$f":"B4","v":"PAZIN"},":",null,{"$f":"E4","v":"BUZET 1"},{"$f":"MAX(Y13:Y20)","v":4},":",{"$f":"MAX(AA13:AA20)","v":1}]
[null,null,null,null,"SETOVI",{"$f":"SUM(V13:V20)","v":13},":",{"$f":"SUM(X13:X20)","v":6}]
[null,null,null,null,"POENI",{"$f":"SUM(F13:F20, I13:I20, L13:L20, O13:O20, R13:R20)","v":177},":",{"$f":"SUM(H13:H20, K13:K20, N13:N20, Q13:Q20, T13:T20)","v":143}]

{"sheet":"ZAPISNIK_3_1","index":12,"n_rows":24,"n_cols":48,"rows_kept":24,"cut":false,"hidden":true,"merged":[[2,23,2,27],[0,0,0,27],[1,1,1,3],[1,4,1,8],[1,9,1,12],[1,13,1,18],[1,19,1,22],[1,23,1,27],[2,1,2,3],[2,4,2,8],[2,9,2,12],[2,13,2,18],[2,19,2,22]]}
["ŽUPANIJSKA LIGA STSIŽ 2025./2026",null,null,null,null,null,null,null,null,null,null,null,null,null,null,null,null,null,null,null,null,null,null,null,null,null,null,null,null,null,null,null,null,null,null,null,null,null,null,null,null,null,null,null,null,null,null,"EDIT"]
[null,"GRAD DOMAĆIN",null,null,"DVORANA",null,null,null,null,"KOLO",null,null,null,"DATUM",null,null,null,null,null,"SAT"]
[null,"PULA",null,null,"MZ Gregovica, Pula",null,null,null,null,"3.",null,null,null,"13. 11. 2025.",null,null,null,null,null,"18:30:00"]
["Domaćin","VAL SHARK",null,"Gost","PAZIN"]
["A","INFANTOLINO Davide",null,"X","LUKEZ Goran"]
["B","DELEVIĆ Predrag",null,"Y","FABRIS Karlo"]
["C","HRVANOVIĆ Jasmin",null,"Z","GLAVINIĆ Denis",null,null,null,null,null," "]
["R1",null,null,"R1"]
["R2",null,null,"R2"]
[]
[null,"DOMAĆIN",null,null,"GOST"]
[null,"VAL SHARK",null,null,"PAZIN"]
[null,"INFANTOLINO Davide","A","X","LUKEZ Goran",11,":",7,11,":",4,11,":",8,null,":",null,null,":",null,null,{"$f":"IF(COUNTA(F13:T13)=0,\"\",_xlfn.LET(_xlpm.h,CHOOSE({1,2,3,4,5},F13,I13,L13,O13,R13),_xlpm.a,CHOOSE({1,2,3,4,5},H13,K13,N13,Q13,T13),SUM((_xlpm.h>_xlpm.a)*(_xlpm.h<>\"\")*(_xlpm.a<>\"\"))))","v":3},":",{"$f":"IF(COUNTA(F13:T13)=0,\"\",_xlfn.LET(_xlpm.h,CHOOSE({1,2,3,4,5},F13,I13,L13,O13,R13),_xlpm.a,CHOOSE({1,2,3,4,5},H13,K13,N13,Q13,T13),SUM((_xlpm.a>_xlpm.h)*(_xlpm.h<>\"\")*(_xlpm.a<>\"\"))))","v":0},{"$f":"IF(OR(V13=\"\",X13=\"\"),\"\",IF(MAX(V13,X13)<3,\"\",SUMPRODUCT(--($V$13:V13>$X$13:X13),--(($V$13:V13>=3)+($X$13:X13>=3)>0))))","v":1},":",{"$f":"IF(OR(V13=\"\",X13=\"\"),\"\",IF(MAX(V13,X13)<3,\"\",SUMPRODUCT(--($X$13:X13>$V$13:V13),--(($V$13:V13>=3)+($X$13:X13>=3)>0))))","v":0}]
[null,"DELEVIĆ Predrag","B","Y","FABRIS Karlo",7,":",11,11,":",9,11,":",4,5,":",11,5,":",11,null,{"$f":"IF(COUNTA(F14:T14)=0,\"\",_xlfn.LET(_xlpm.h,CHOOSE({1,2,3,4,5},F14,I14,L14,O14,R14),_xlpm.a,CHOOSE({1,2,3,4,5},H14,K14,N14,Q14,T14),SUM((_xlpm.h>_xlpm.a)*(_xlpm.h<>\"\")*(_xlpm.a<>\"\"))))","v":2},":",{"$f":"IF(COUNTA(F14:T14)=0,\"\",_xlfn.LET(_xlpm.h,CHOOSE({1,2,3,4,5},F14,I14,L14,O14,R14),_xlpm.a,CHOOSE({1,2,3,4,5},H14,K14,N14,Q14,T14),SUM((_xlpm.a>_xlpm.h)*(_xlpm.h<>\"\")*(_xlpm.a<>\"\"))))","v":3},{"$f":"IF(OR(V14=\"\",X14=\"\"),\"\",IF(MAX(V14,X14)<3,\"\",SUMPRODUCT(--($V$13:V14>$X$13:X14),--(($V$13:V14>=3)+($X$13:X14>=3)>0))))","v":1},":",{"$f":"IF(OR(V14=\"\",X14=\"\"),\"\",IF(MAX(V14,X14)<3,\"\",SUMPRODUCT(--($X$13:X14>$V$13:V14),--(($V$13:V14>=3)+($X$13:X14>=3)>0))))","v":1}]
[null,"HRVANOVIĆ Jasmin","C","Z","GLAVINIĆ Denis",6,":",11,11,":",5,13,":",11,8,":",11,11,":",5,null,{"$f":"IF(COUNTA(F15:T15)=0,\"\",_xlfn.LET(_xlpm.h,CHOOSE({1,2,3,4,5},F15,I15,L15,O15,R15),_xlpm.a,CHOOSE({1,2,3,4,5},H15,K15,N15,Q15,T15),SUM((_xlpm.h>_xlpm.a)*(_xlpm.h<>\"\")*(_xlpm.a<>\"\"))))","v":3},":",{"$f":"IF(COUNTA(F15:T15)=0,\"\",_xlfn.LET(_xlpm.h,CHOOSE({1,2,3,4,5},F15,I15,L15,O15,R15),_xlpm.a,CHOOSE({1,2,3,4,5},H15,K15,N15,Q15,T15),SUM((_xlpm.a>_xlpm.h)*(_xlpm.h<>\"\")*(_xlpm.a<>\"\"))))","v":2},{"$f":"IF(OR(V15=\"\",X15=\"\"),\"\",IF(MAX(V15,X15)<3,\"\",SUMPRODUCT(--($V$13:V15>$X$13:X15),--(($V$13:V15>=3)+($X$13:X15>=3)>0))))","v":2},":",{"$f":"IF(OR(V15=\"\",X15=\"\"),\"\",IF(MAX(V15,X15)<3,\"\",SUMPRODUCT(--($X$13:X15>$V$13:V15),--(($V$13:V15>=3)+($X$13:X15>=3)>0))))","v":1}]
[null,"INFANTOLINO D., HRVANOVIĆ J.","PAR","PAR","GLAVINIĆ D., LUKEZ G.",8,":",11,11,":",8,9,":",11,11,":",6,11,":",5,null,{"$f":"IF(COUNTA(F16:T16)=0,\"\",_xlfn.LET(_xlpm.h,CHOOSE({1,2,3,4,5},F16,I16,L16,O16,R16),_xlpm.a,CHOOSE({1,2,3,4,5},H16,K16,N16,Q16,T16),SUM((_xlpm.h>_xlpm.a)*(_xlpm.h<>\"\")*(_xlpm.a<>\"\"))))","v":3},":",{"$f":"IF(COUNTA(F16:T16)=0,\"\",_xlfn.LET(_xlpm.h,CHOOSE({1,2,3,4,5},F16,I16,L16,O16,R16),_xlpm.a,CHOOSE({1,2,3,4,5},H16,K16,N16,Q16,T16),SUM((_xlpm.a>_xlpm.h)*(_xlpm.h<>\"\")*(_xlpm.a<>\"\"))))","v":2},{"$f":"IF(OR(V16=\"\",X16=\"\"),\"\",IF(MAX(V16,X16)<3,\"\",SUMPRODUCT(--($V$13:V16>$X$13:X16),--(($V$13:V16>=3)+($X$13:X16>=3)>0))))","v":3},":",{"$f":"IF(OR(V16=\"\",X16=\"\"),\"\",IF(MAX(V16,X16)<3,\"\",SUMPRODUCT(--($X$13:X16>$V$13:V16),--(($V$13:V16>=3)+($X$13:X16>=3)>0))))","v":1}]
[null,null,null,null,null,null,":",null,null,":",null,null,":",null,null,":",null,null,":",null,null,{"$f":"IF(COUNTA(F17:T17)=0,\"\",_xlfn.LET(_xlpm.h,CHOOSE({1,2,3,4,5},F17,I17,L17,O17,R17),_xlpm.a,CHOOSE({1,2,3,4,5},H17,K17,N17,Q17,T17),SUM((_xlpm.h>_xlpm.a)*(_xlpm.h<>\"\")*(_xlpm.a<>\"\"))))","v":0},":",{"$f":"IF(COUNTA(F17:T17)=0,\"\",_xlfn.LET(_xlpm.h,CHOOSE({1,2,3,4,5},F17,I17,L17,O17,R17),_xlpm.a,CHOOSE({1,2,3,4,5},H17,K17,N17,Q17,T17),SUM((_xlpm.a>_xlpm.h)*(_xlpm.h<>\"\")*(_xlpm.a<>\"\"))))","v":0},{"$f":"IF(OR(V17=\"\",X17=\"\"),\"\",IF(MAX(V17,X17)<3,\"\",SUMPRODUCT(--($V$13:V17>$X$13:X17),--(($V$13:V17>=3)+($X$13:X17>=3)>0))))","v":""},":",{"$f":"IF(OR(V17=\"\",X17=\"\"),\"\",IF(MAX(V17,X17)<3,\"\",SUMPRODUCT(--($X$13:X17>$V$13:V17),--(($V$13:V17>=3)+($X$13:X17>=3)>0))))","v":""}]
[null,"INFANTOLINO Davide","A","Y","FABRIS Karlo",11,":",7,11,":",3,13,":",11,null,":",null,null,":",null,null,{"$f":"IF(COUNTA(F18:T18)=0,\"\",_xlfn.LET(_xlpm.h,CHOOSE({1,2,3,4,5},F18,I18,L18,O18,R18),_xlpm.a,CHOOSE({1,2,3,4,5},H18,K18,N18,Q18,T18),SUM((_xlpm.h>_xlpm.a)*(_xlpm.h<>\"\")*(_xlpm.a<>\"\"))))","v":3},":",{"$f":"IF(COUNTA(F18:T18)=0,\"\",_xlfn.LET(_xlpm.h,CHOOSE({1,2,3,4,5},F18,I18,L18,O18,R18),_xlpm.a,CHOOSE({1,2,3,4,5},H18,K18,N18,Q18,T18),SUM((_xlpm.a>_xlpm.h)*(_xlpm.h<>\"\")*(_xlpm.a<>\"\"))))","v":0},{"$f":"IF(OR(V18=\"\",X18=\"\"),\"\",IF(MAX(V18,X18)<3,\"\",SUMPRODUCT(--($V$13:V18>$X$13:X18),--(($V$13:V18>=3)+($X$13:X18>=3)>0))))","v":4},":",{"$f":"IF(OR(V18=\"\",X18=\"\"),\"\",IF(MAX(V18,X18)<3,\"\",SUMPRODUCT(--($X$13:X18>$V$13:V18),--(($V$13:V18>=3)+($X$13:X18>=3)>0))))","v":1}]
[null,null,"C","X",null,null,":",null,null,":",null,null,":",null,null,":",null,null,":",null,null,{"$f":"IF(COUNTA(F19:T19)=0,\"\",_xlfn.LET(_xlpm.h,CHOOSE({1,2,3,4,5},F19,I19,L19,O19,R19),_xlpm.a,CHOOSE({1,2,3,4,5},H19,K19,N19,Q19,T19),SUM((_xlpm.h>_xlpm.a)*(_xlpm.h<>\"\")*(_xlpm.a<>\"\"))))","v":0},":",{"$f":"IF(COUNTA(F19:T19)=0,\"\",_xlfn.LET(_xlpm.h,CHOOSE({1,2,3,4,5},F19,I19,L19,O19,R19),_xlpm.a,CHOOSE({1,2,3,4,5},H19,K19,N19,Q19,T19),SUM((_xlpm.a>_xlpm.h)*(_xlpm.h<>\"\")*(_xlpm.a<>\"\"))))","v":0},{"$f":"IF(OR(V19=\"\",X19=\"\"),\"\",IF(MAX(V19,X19)<3,\"\",SUMPRODUCT(--($V$13:V19>$X$13:X19),--(($V$13:V19>=3)+($X$13:X19>=3)>0))))","v":""},":",{"$f":"IF(OR(V19=\"\",X19=\"\"),\"\",IF(MAX(V19,X19)<3,\"\",SUMPRODUCT(--($X$13:X19>$V$13:V19),--(($V$13:V19>=3)+($X$13:X19>=3)>0))))","v":""}]
[null,null,"B","Z",null,null,":",null,null,":",null,null,":",null,null,":",null,null,":",null,null,{"$f":"IF(COUNTA(F20:T20)=0,\"\",_xlfn.LET(_xlpm.h,CHOOSE({1,2,3,4,5},F20,I20,L20,O20,R20),_xlpm.a,CHOOSE({1,2,3,4,5},H20,K20,N20,Q20,T20),SUM((_xlpm.h>_xlpm.a)*(_xlpm.h<>\"\")*(_xlpm.a<>\"\"))))","v":0},":",{"$f":"IF(COUNTA(F20:T20)=0,\"\",_xlfn.LET(_xlpm.h,CHOOSE({1,2,3,4,5},F20,I20,L20,O20,R20),_xlpm.a,CHOOSE({1,2,3,4,5},H20,K20,N20,Q20,T20),SUM((_xlpm.a>_xlpm.h)*(_xlpm.h<>\"\")*(_xlpm.a<>\"\"))))","v":0},{"$f":"IF(OR(V20=\"\",X20=\"\"),\"\",IF(MAX(V20,X20)<3,\"\",SUMPRODUCT(--($V$13:V20>$X$13:X20),--(($V$13:V20>=3)+($X$13:X20>=3)>0))))","v":""},":",{"$f":"IF(OR(V20=\"\",X20=\"\"),\"\",IF(MAX(V20,X20)<3,\"\",SUMPRODUCT(--($X$13:X20>$V$13:V20),--(($V$13:V20>=3)+($X$13:X20>=3)>0))))","v":""}]
[]
[null,{"$f":"B4","v":"VAL SHARK"},":",null,{"$f":"E4","v":"PAZIN"},{"$f":"MAX(Y13:Y20)","v":4},":",{"$f":"MAX(AA13:AA20)","v":1}]
[null,null,null,null,"SETOVI",{"$f":"SUM(V13:V20)","v":14},":",{"$f":"SUM(X13:X20)","v":7}]
[null,null,null,null,"POENI",{"$f":"SUM(F13:F20, I13:I20, L13:L20, O13:O20, R13:R20)","v":206},":",{"$f":"SUM(H13:H20, K13:K20, N13:N20, Q13:Q20, T13:T20)","v":170}]

{"sheet":"ZAPISNIK_3_2","index":13,"n_rows":24,"n_cols":48,"rows_kept":24,"cut":false,"hidden":true,"merged":[[2,23,2,27],[0,0,0,27],[1,1,1,3],[1,4,1,8],[1,9,1,12],[1,13,1,18],[1,19,1,22],[1,23,1,27],[2,1,2,3],[2,4,2,8],[2,9,2,12],[2,13,2,18],[2,19,2,22]]}
["ŽUPANIJSKA LIGA STSIŽ 2025./2026",null,null,null,null,null,null,null,null,null,null,null,null,null,null,null,null,null,null,null,null,null,null,null,null,null,null,null,null,null,null,null,null,null,null,null,null,null,null,null,null,null,null,null,null,null,null,"EDIT"]
[null,"GRAD DOMAĆIN",null,null,"DVORANA",null,null,null,null,"KOLO",null,null,null,"DATUM",null,null,null,null,null,"SAT"]
[null,"PULA",null,null,"Dvorana STK Arena Ferro, Rojc",null,null,null,null,"3.",null,null,null,"12. 11. 2025.",null,null,null,null,null,"17:30:00"]
["Domaćin","ARENA FERRO",null,"Gost","PAZIN"]
["A","CINKOPAN Kristijan",null,"X","LUKEZ Goran"]
["B","KELEMEN Mićo",null,"Y","GLAVINIĆ Denis"]
["C","KRANJC Dino",null,"Z","FABIJAN Damir",null,null,null,null,null," "]
["R1",null,null,"R1"]
["R2",null,null,"R2"]
[]
[null,"DOMAĆIN",null,null,"GOST"]
[null,"ARENA FERRO",null,null,"PAZIN"]
[null,"CINKOPAN Kristijan","A","X","LUKEZ Goran",11,":",9,11,":",13,11,":",5,11,":",9,null,":",null,null,{"$f":"IF(COUNTA(F13:T13)=0,\"\",_xlfn.LET(_xlpm.h,CHOOSE({1,2,3,4,5},F13,I13,L13,O13,R13),_xlpm.a,CHOOSE({1,2,3,4,5},H13,K13,N13,Q13,T13),SUM((_xlpm.h>_xlpm.a)*(_xlpm.h<>\"\")*(_xlpm.a<>\"\"))))","v":3},":",{"$f":"IF(COUNTA(F13:T13)=0,\"\",_xlfn.LET(_xlpm.h,CHOOSE({1,2,3,4,5},F13,I13,L13,O13,R13),_xlpm.a,CHOOSE({1,2,3,4,5},H13,K13,N13,Q13,T13),SUM((_xlpm.a>_xlpm.h)*(_xlpm.h<>\"\")*(_xlpm.a<>\"\"))))","v":1},{"$f":"IF(OR(V13=\"\",X13=\"\"),\"\",IF(MAX(V13,X13)<3,\"\",SUMPRODUCT(--($V$13:V13>$X$13:X13),--(($V$13:V13>=3)+($X$13:X13>=3)>0))))","v":1},":",{"$f":"IF(OR(V13=\"\",X13=\"\"),\"\",IF(MAX(V13,X13)<3,\"\",SUMPRODUCT(--($X$13:X13>$V$13:V13),--(($V$13:V13>=3)+($X$13:X13>=3)>0))))","v":0}]
[null,"KELEMEN Mićo","B","Y","GLAVINIĆ Denis",3,":",11,8,":",11,3,":",11,null,":",null,null,":",null,null,{"$f":"IF(COUNTA(F14:T14)=0,\"\",_xlfn.LET(_xlpm.h,CHOOSE({1,2,3,4,5},F14,I14,L14,O14,R14),_xlpm.a,CHOOSE({1,2,3,4,5},H14,K14,N14,Q14,T14),SUM((_xlpm.h>_xlpm.a)*(_xlpm.h<>\"\")*(_xlpm.a<>\"\"))))","v":0},":",{"$f":"IF(COUNTA(F14:T14)=0,\"\",_xlfn.LET(_xlpm.h,CHOOSE({1,2,3,4,5},F14,I14,L14,O14,R14),_xlpm.a,CHOOSE({1,2,3,4,5},H14,K14,N14,Q14,T14),SUM((_xlpm.a>_xlpm.h)*(_xlpm.h<>\"\")*(_xlpm.a<>\"\"))))","v":3},{"$f":"IF(OR(V14=\"\",X14=\"\"),\"\",IF(MAX(V14,X14)<3,\"\",SUMPRODUCT(--($V$13:V14>$X$13:X14),--(($V$13:V14>=3)+($X$13:X14>=3)>0))))","v":1},":",{"$f":"IF(OR(V14=\"\",X14=\"\"),\"\",IF(MAX(V14,X14)<3,\"\",SUMPRODUCT(--($X$13:X14>$V$13:V14),--(($V$13:V14>=3)+($X$13:X14>=3)>0))))","v":1}]
[null,"KRANJC Dino","C","Z","FABIJAN Damir",11,":",4,11,":",4,11,":",6,null,":",null,null,":",null,null,{"$f":"IF(COUNTA(F15:T15)=0,\"\",_xlfn.LET(_xlpm.h,CHOOSE({1,2,3,4,5},F15,I15,L15,O15,R15),_xlpm.a,CHOOSE({1,2,3,4,5},H15,K15,N15,Q15,T15),SUM((_xlpm.h>_xlpm.a)*(_xlpm.h<>\"\")*(_xlpm.a<>\"\"))))","v":3},":",{"$f":"IF(COUNTA(F15:T15)=0,\"\",_xlfn.LET(_xlpm.h,CHOOSE({1,2,3,4,5},F15,I15,L15,O15,R15),_xlpm.a,CHOOSE({1,2,3,4,5},H15,K15,N15,Q15,T15),SUM((_xlpm.a>_xlpm.h)*(_xlpm.h<>\"\")*(_xlpm.a<>\"\"))))","v":0},{"$f":"IF(OR(V15=\"\",X15=\"\"),\"\",IF(MAX(V15,X15)<3,\"\",SUMPRODUCT(--($V$13:V15>$X$13:X15),--(($V$13:V15>=3)+($X$13:X15>=3)>0))))","v":2},":",{"$f":"IF(OR(V15=\"\",X15=\"\"),\"\",IF(MAX(V15,X15)<3,\"\",SUMPRODUCT(--($X$13:X15>$V$13:V15),--(($V$13:V15>=3)+($X$13:X15>=3)>0))))","v":1}]
[null,"CINKOPAN K., KRANJC D.","PAR","PAR","GLAVINIĆ D., FABIJAN D.",11,":",2,11,":",8,11,":",5,null,":",null,null,":",null,null,{"$f":"IF(COUNTA(F16:T16)=0,\"\",_xlfn.LET(_xlpm.h,CHOOSE({1,2,3,4,5},F16,I16,L16,O16,R16),_xlpm.a,CHOOSE({1,2,3,4,5},H16,K16,N16,Q16,T16),SUM((_xlpm.h>_xlpm.a)*(_xlpm.h<>\"\")*(_xlpm.a<>\"\"))))","v":3},":",{"$f":"IF(COUNTA(F16:T16)=0,\"\",_xlfn.LET(_xlpm.h,CHOOSE({1,2,3,4,5},F16,I16,L16,O16,R16),_xlpm.a,CHOOSE({1,2,3,4,5},H16,K16,N16,Q16,T16),SUM((_xlpm.a>_xlpm.h)*(_xlpm.h<>\"\")*(_xlpm.a<>\"\"))))","v":0},{"$f":"IF(OR(V16=\"\",X16=\"\"),\"\",IF(MAX(V16,X16)<3,\"\",SUMPRODUCT(--($V$13:V16>$X$13:X16),--(($V$13:V16>=3)+($X$13:X16>=3)>0))))","v":3},":",{"$f":"IF(OR(V16=\"\",X16=\"\"),\"\",IF(MAX(V16,X16)<3,\"\",SUMPRODUCT(--($X$13:X16>$V$13:V16),--(($V$13:V16>=3)+($X$13:X16>=3)>0))))","v":1}]
[null,null,null,null,null,null,":",null,null,":",null,null,":",null,null,":",null,null,":",null,null,{"$f":"IF(COUNTA(F17:T17)=0,\"\",_xlfn.LET(_xlpm.h,CHOOSE({1,2,3,4,5},F17,I17,L17,O17,R17),_xlpm.a,CHOOSE({1,2,3,4,5},H17,K17,N17,Q17,T17),SUM((_xlpm.h>_xlpm.a)*(_xlpm.h<>\"\")*(_xlpm.a<>\"\"))))","v":0},":",{"$f":"IF(COUNTA(F17:T17)=0,\"\",_xlfn.LET(_xlpm.h,CHOOSE({1,2,3,4,5},F17,I17,L17,O17,R17),_xlpm.a,CHOOSE({1,2,3,4,5},H17,K17,N17,Q17,T17),SUM((_xlpm.a>_xlpm.h)*(_xlpm.h<>\"\")*(_xlpm.a<>\"\"))))","v":0},{"$f":"IF(OR(V17=\"\",X17=\"\"),\"\",IF(MAX(V17,X17)<3,\"\",SUMPRODUCT(--($V$13:V17>$X$13:X17),--(($V$13:V17>=3)+($X$13:X17>=3)>0))))","v":""},":",{"$f":"IF(OR(V17=\"\",X17=\"\"),\"\",IF(MAX(V17,X17)<3,\"\",SUMPRODUCT(--($X$13:X17>$V$13:V17),--(($V$13:V17>=3)+($X$13:X17>=3)>0))))","v":""}]
[null,"CINKOPAN Kristijan","A","Y","GLAVINIĆ Denis",6,":",11,11,":",7,8,":",11,11,":",3,6,":",11,null,{"$f":"IF(COUNTA(F18:T18)=0,\"\",_xlfn.LET(_xlpm.h,CHOOSE({1,2,3,4,5},F18,I18,L18,O18,R18),_xlpm.a,CHOOSE({1,2,3,4,5},H18,K18,N18,Q18,T18),SUM((_xlpm.h>_xlpm.a)*(_xlpm.h<>\"\")*(_xlpm.a<>\"\"))))","v":2},":",{"$f":"IF(COUNTA(F18:T18)=0,\"\",_xlfn.LET(_xlpm.h,CHOOSE({1,2,3,4,5},F18,I18,L18,O18,R18),_xlpm.a,CHOOSE({1,2,3,4,5},H18,K18,N18,Q18,T18),SUM((_xlpm.a>_xlpm.h)*(_xlpm.h<>\"\")*(_xlpm.a<>\"\"))))","v":3},{"$f":"IF(OR(V18=\"\",X18=\"\"),\"\",IF(MAX(V18,X18)<3,\"\",SUMPRODUCT(--($V$13:V18>$X$13:X18),--(($V$13:V18>=3)+($X$13:X18>=3)>0))))","v":3},":",{"$f":"IF(OR(V18=\"\",X18=\"\"),\"\",IF(MAX(V18,X18)<3,\"\",SUMPRODUCT(--($X$13:X18>$V$13:V18),--(($V$13:V18>=3)+($X$13:X18>=3)>0))))","v":2}]
[null,"KRANJC Dino","C","X","LUKEZ Goran",4,":",11,11,":",5,11,":",13,5,":",11,null,":",null,null,{"$f":"IF(COUNTA(F19:T19)=0,\"\",_xlfn.LET(_xlpm.h,CHOOSE({1,2,3,4,5},F19,I19,L19,O19,R19),_xlpm.a,CHOOSE({1,2,3,4,5},H19,K19,N19,Q19,T19),SUM((_xlpm.h>_xlpm.a)*(_xlpm.h<>\"\")*(_xlpm.a<>\"\"))))","v":1},":",{"$f":"IF(COUNTA(F19:T19)=0,\"\",_xlfn.LET(_xlpm.h,CHOOSE({1,2,3,4,5},F19,I19,L19,O19,R19),_xlpm.a,CHOOSE({1,2,3,4,5},H19,K19,N19,Q19,T19),SUM((_xlpm.a>_xlpm.h)*(_xlpm.h<>\"\")*(_xlpm.a<>\"\"))))","v":3},{"$f":"IF(OR(V19=\"\",X19=\"\"),\"\",IF(MAX(V19,X19)<3,\"\",SUMPRODUCT(--($V$13:V19>$X$13:X19),--(($V$13:V19>=3)+($X$13:X19>=3)>0))))","v":3},":",{"$f":"IF(OR(V19=\"\",X19=\"\"),\"\",IF(MAX(V19,X19)<3,\"\",SUMPRODUCT(--($X$13:X19>$V$13:V19),--(($V$13:V19>=3)+($X$13:X19>=3)>0))))","v":3}]
[null,"KELEMEN Mićo","B","Z","FABIJAN Damir",11,":",9,6,":",11,11,":",2,7,":",11,9,":",11,null,{"$f":"IF(COUNTA(F20:T20)=0,\"\",_xlfn.LET(_xlpm.h,CHOOSE({1,2,3,4,5},F20,I20,L20,O20,R20),_xlpm.a,CHOOSE({1,2,3,4,5},H20,K20,N20,Q20,T20),SUM((_xlpm.h>_xlpm.a)*(_xlpm.h<>\"\")*(_xlpm.a<>\"\"))))","v":2},":",{"$f":"IF(COUNTA(F20:T20)=0,\"\",_xlfn.LET(_xlpm.h,CHOOSE({1,2,3,4,5},F20,I20,L20,O20,R20),_xlpm.a,CHOOSE({1,2,3,4,5},H20,K20,N20,Q20,T20),SUM((_xlpm.a>_xlpm.h)*(_xlpm.h<>\"\")*(_xlpm.a<>\"\"))))","v":3},{"$f":"IF(OR(V20=\"\",X20=\"\"),\"\",IF(MAX(V20,X20)<3,\"\",SUMPRODUCT(--($V$13:V20>$X$13:X20),--(($V$13:V20>=3)+($X$13:X20>=3)>0))))","v":3},":",{"$f":"IF(OR(V20=\"\",X20=\"\"),\"\",IF(MAX(V20,X20)<3,\"\",SUMPRODUCT(--($X$13:X20>$V$13:V20),--(($V$13:V20>=3)+($X$13:X20>=3)>0))))","v":4}]
[]
[null,{"$f":"B4","v":"ARENA FERRO"},":",null,{"$f":"E4","v":"PAZIN"},{"$f":"MAX(Y13:Y20)","v":3},":",{"$f":"MAX(AA13:AA20)","v":4}]
[null,null,null,null,"SETOVI",{"$f":"SUM(V13:V20)","v":14},":",{"$f":"SUM(X13:X20)","v":13}]
[null,null,null,null,"POENI",{"$f":"SUM(F13:F20, I13:I20, L13:L20, O13:O20, R13:R20)","v":241},":",{"$f":"SUM(H13:H20, K13:K20, N13:N20, Q13:Q20, T13:T20)","v":225}]

{"sheet":"ZAPISNIK_3_3","index":14,"n_rows":24,"n_cols":48,"rows_kept":24,"cut":false,"hidden":true,"merged":[[2,23,2,27],[0,0,0,27],[1,1,1,3],[1,4,1,8],[1,9,1,12],[1,13,1,18],[1,19,1,22],[1,23,1,27],[2,1,2,3],[2,4,2,8],[2,9,2,12],[2,13,2,18],[2,19,2,22]]}
["ŽUPANIJSKA LIGA STSIŽ 2025./2026",null,null,null,null,null,null,null,null,null,null,null,null,null,null,null,null,null,null,null,null,null,null,null,null,null,null,null,null,null,null,null,null,null,null,null,null,null,null,null,null,null,null,null,null,null,null,"EDIT"]
[null,"GRAD DOMAĆIN",null,null,"DVORANA",null,null,null,null,"KOLO",null,null,null,"DATUM",null,null,null,null,null,"SAT"]
[null,"BUZET",null,null,"SD Buzet",null,null,null,null,"3.",null,null,null,"12. 11. 2025.",null,null,null,null,null,"19:30:00"]
["Domaćin","BUZET 2",null,"Gost","MAESTRAL 2"]
["A","DRAŠĆIĆ Petar",null,"X","KMET Teo"]
["B","KOS Dino",null,"Y","HANZL Tomislav"]
["C","PAVLETIĆ Guido",null,"Z","VIŽINTIN Marino",null,null,null,null,null," "]
["R1",null,null,"R1"]
["R2",null,null,"R2"]
[]
[null,"DOMAĆIN",null,null,"GOST"]
[null,"BUZET 2",null,null,"MAESTRAL 2"]
[null,"DRAŠĆIĆ Petar","A","X","KMET Teo",11,":",13,11,":",7,11,":",6,11,":",7,null,":",null,null,{"$f":"IF(COUNTA(F13:T13)=0,\"\",_xlfn.LET(_xlpm.h,CHOOSE({1,2,3,4,5},F13,I13,L13,O13,R13),_xlpm.a,CHOOSE({1,2,3,4,5},H13,K13,N13,Q13,T13),SUM((_xlpm.h>_xlpm.a)*(_xlpm.h<>\"\")*(_xlpm.a<>\"\"))))","v":3},":",{"$f":"IF(COUNTA(F13:T13)=0,\"\",_xlfn.LET(_xlpm.h,CHOOSE({1,2,3,4,5},F13,I13,L13,O13,R13),_xlpm.a,CHOOSE({1,2,3,4,5},H13,K13,N13,Q13,T13),SUM((_xlpm.a>_xlpm.h)*(_xlpm.h<>\"\")*(_xlpm.a<>\"\"))))","v":1},{"$f":"IF(OR(V13=\"\",X13=\"\"),\"\",IF(MAX(V13,X13)<3,\"\",SUMPRODUCT(--($V$13:V13>$X$13:X13),--(($V$13:V13>=3)+($X$13:X13>=3)>0))))","v":1},":",{"$f":"IF(OR(V13=\"\",X13=\"\"),\"\",IF(MAX(V13,X13)<3,\"\",SUMPRODUCT(--($X$13:X13>$V$13:V13),--(($V$13:V13>=3)+($X$13:X13>=3)>0))))","v":0}]
[null,"KOS Dino","B","Y","HANZL Tomislav",11,":",8,11,":",5,7,":",11,11,":",9,null,":",null,null,{"$f":"IF(COUNTA(F14:T14)=0,\"\",_xlfn.LET(_xlpm.h,CHOOSE({1,2,3,4,5},F14,I14,L14,O14,R14),_xlpm.a,CHOOSE({1,2,3,4,5},H14,K14,N14,Q14,T14),SUM((_xlpm.h>_xlpm.a)*(_xlpm.h<>\"\")*(_xlpm.a<>\"\"))))","v":3},":",{"$f":"IF(COUNTA(F14:T14)=0,\"\",_xlfn.LET(_xlpm.h,CHOOSE({1,2,3,4,5},F14,I14,L14,O14,R14),_xlpm.a,CHOOSE({1,2,3,4,5},H14,K14,N14,Q14,T14),SUM((_xlpm.a>_xlpm.h)*(_xlpm.h<>\"\")*(_xlpm.a<>\"\"))))","v":1},{"$f":"IF(OR(V14=\"\",X14=\"\"),\"\",IF(MAX(V14,X14)<3,\"\",SUMPRODUCT(--($V$13:V14>$X$13:X14),--(($V$13:V14>=3)+($X$13:X14>=3)>0))))","v":2},":",{"$f":"IF(OR(V14=\"\",X14=\"\"),\"\",IF(MAX(V14,X14)<3,\"\",SUMPRODUCT(--($X$13:X14>$V$13:V14),--(($V$13:V14>=3)+($X$13:X14>=3)>0))))","v":0}]
[null,"PAVLETIĆ Guido","C","Z","VIŽINTIN Marino",11,":",7,11,":",7,13,":",11,null,":",null,null,":",null,null,{"$f":"IF(COUNTA(F15:T15)=0,\"\",_xlfn.LET(_xlpm.h,CHOOSE({1,2,3,4,5},F15,I15,L15,O15,R15),_xlpm.a,CHOOSE({1,2,3,4,5},H15,K15,N15,Q15,T15),SUM((_xlpm.h>_xlpm.a)*(_xlpm.h<>\"\")*(_xlpm.a<>\"\"))))","v":3},":",{"$f":"IF(COUNTA(F15:T15)=0,\"\",_xlfn.LET(_xlpm.h,CHOOSE({1,2,3,4,5},F15,I15,L15,O15,R15),_xlpm.a,CHOOSE({1,2,3,4,5},H15,K15,N15,Q15,T15),SUM((_xlpm.a>_xlpm.h)*(_xlpm.h<>\"\")*(_xlpm.a<>\"\"))))","v":0},{"$f":"IF(OR(V15=\"\",X15=\"\"),\"\",IF(MAX(V15,X15)<3,\"\",SUMPRODUCT(--($V$13:V15>$X$13:X15),--(($V$13:V15>=3)+($X$13:X15>=3)>0))))","v":3},":",{"$f":"IF(OR(V15=\"\",X15=\"\"),\"\",IF(MAX(V15,X15)<3,\"\",SUMPRODUCT(--($X$13:X15>$V$13:V15),--(($V$13:V15>=3)+($X$13:X15>=3)>0))))","v":0}]
[null,"KOS D., PAVLETIĆ G.","PAR","PAR","KMET T., HANZL T.",14,":",12,10,":",12,11,":",5,2,":",11,12,":",10,null,{"$f":"IF(COUNTA(F16:T16)=0,\"\",_xlfn.LET(_xlpm.h,CHOOSE({1,2,3,4,5},F16,I16,L16,O16,R16),_xlpm.a,CHOOSE({1,2,3,4,5},H16,K16,N16,Q16,T16),SUM((_xlpm.h>_xlpm.a)*(_xlpm.h<>\"\")*(_xlpm.a<>\"\"))))","v":3},":",{"$f":"IF(COUNTA(F16:T16)=0,\"\",_xlfn.LET(_xlpm.h,CHOOSE({1,2,3,4,5},F16,I16,L16,O16,R16),_xlpm.a,CHOOSE({1,2,3,4,5},H16,K16,N16,Q16,T16),SUM((_xlpm.a>_xlpm.h)*(_xlpm.h<>\"\")*(_xlpm.a<>\"\"))))","v":2},{"$f":"IF(OR(V16=\"\",X16=\"\"),\"\",IF(MAX(V16,X16)<3,\"\",SUMPRODUCT(--($V$13:V16>$X$13:X16),--(($V$13:V16>=3)+($X$13:X16>=3)>0))))","v":4},":",{"$f":"IF(OR(V16=\"\",X16=\"\"),\"\",IF(MAX(V16,X16)<3,\"\",SUMPRODUCT(--($X$13:X16>$V$13:V16),--(($V$13:V16>=3)+($X$13:X16>=3)>0))))","v":0}]
[null,null,null,null,null,null,":",null,null,":",null,null,":",null,null,":",null,null,":",null,null,{"$f":"IF(COUNTA(F17:T17)=0,\"\",_xlfn.LET(_xlpm.h,CHOOSE({1,2,3,4,5},F17,I17,L17,O17,R17),_xlpm.a,CHOOSE({1,2,3,4,5},H17,K17,N17,Q17,T17),SUM((_xlpm.h>_xlpm.a)*(_xlpm.h<>\"\")*(_xlpm.a<>\"\"))))","v":0},":",{"$f":"IF(COUNTA(F17:T17)=0,\"\",_xlfn.LET(_xlpm.h,CHOOSE({1,2,3,4,5},F17,I17,L17,O17,R17),_xlpm.a,CHOOSE({1,2,3,4,5},H17,K17,N17,Q17,T17),SUM((_xlpm.a>_xlpm.h)*(_xlpm.h<>\"\")*(_xlpm.a<>\"\"))))","v":0},{"$f":"IF(OR(V17=\"\",X17=\"\"),\"\",IF(MAX(V17,X17)<3,\"\",SUMPRODUCT(--($V$13:V17>$X$13:X17),--(($V$13:V17>=3)+($X$13:X17>=3)>0))))","v":""},":",{"$f":"IF(OR(V17=\"\",X17=\"\"),\"\",IF(MAX(V17,X17)<3,\"\",SUMPRODUCT(--($X$13:X17>$V$13:V17),--(($V$13:V17>=3)+($X$13:X17>=3)>0))))","v":""}]
[null,null,"A","Y",null,null,":",null,null,":",null,null,":",null,null,":",null,null,":",null,null,{"$f":"IF(COUNTA(F18:T18)=0,\"\",_xlfn.LET(_xlpm.h,CHOOSE({1,2,3,4,5},F18,I18,L18,O18,R18),_xlpm.a,CHOOSE({1,2,3,4,5},H18,K18,N18,Q18,T18),SUM((_xlpm.h>_xlpm.a)*(_xlpm.h<>\"\")*(_xlpm.a<>\"\"))))","v":0},":",{"$f":"IF(COUNTA(F18:T18)=0,\"\",_xlfn.LET(_xlpm.h,CHOOSE({1,2,3,4,5},F18,I18,L18,O18,R18),_xlpm.a,CHOOSE({1,2,3,4,5},H18,K18,N18,Q18,T18),SUM((_xlpm.a>_xlpm.h)*(_xlpm.h<>\"\")*(_xlpm.a<>\"\"))))","v":0},{"$f":"IF(OR(V18=\"\",X18=\"\"),\"\",IF(MAX(V18,X18)<3,\"\",SUMPRODUCT(--($V$13:V18>$X$13:X18),--(($V$13:V18>=3)+($X$13:X18>=3)>0))))","v":""},":",{"$f":"IF(OR(V18=\"\",X18=\"\"),\"\",IF(MAX(V18,X18)<3,\"\",SUMPRODUCT(--($X$13:X18>$V$13:V18),--(($V$13:V18>=3)+($X$13:X18>=3)>0))))","v":""}]
[null,null,"C","X",null,null,":",null,null,":",null,null,":",null,null,":",null,null,":",null,null,{"$f":"IF(COUNTA(F19:T19)=0,\"\",_xlfn.LET(_xlpm.h,CHOOSE({1,2,3,4,5},F19,I19,L19,O19,R19),_xlpm.a,CHOOSE({1,2,3,4,5},H19,K19,N19,Q19,T19),SUM((_xlpm.h>_xlpm.a)*(_xlpm.h<>\"\")*(_xlpm.a<>\"\"))))","v":0},":",{"$f":"IF(COUNTA(F19:T19)=0,\"\",_xlfn.LET(_xlpm.h,CHOOSE({1,2,3,4,5},F19,I19,L19,O19,R19),_xlpm.a,CHOOSE({1,2,3,4,5},H19,K19,N19,Q19,T19),SUM((_xlpm.a>_xlpm.h)*(_xlpm.h<>\"\")*(_xlpm.a<>\"\"))))","v":0},{"$f":"IF(OR(V19=\"\",X19=\"\"),\"\",IF(MAX(V19,X19)<3,\"\",SUMPRODUCT(--($V$13:V19>$X$13:X19),--(($V$13:V19>=3)+($X$13:X19>=3)>0))))","v":""},":",{"$f":"IF(OR(V19=\"\",X19=\"\"),\"\",IF(MAX(V19,X19)<3,\"\",SUMPRODUCT(--($X$13:X19>$V$13:V19),--(($V$13:V19>=3)+($X$13:X19>=3)>0))))","v":""}]
[null,null,"B","Z",null,null,":",null,null,":",null,null,":",null,null,":",null,null,":",null,null,{"$f":"IF(COUNTA(F20:T20)=0,\"\",_xlfn.LET(_xlpm.h,CHOOSE({1,2,3,4,5},F20,I20,L20,O20,R20),_xlpm.a,CHOOSE({1,2,3,4,5},H20,K20,N20,Q20,T20),SUM((_xlpm.h>_xlpm.a)*(_xlpm.h<>\"\")*(_xlpm.a<>\"\"))))","v":0},":",{"$f":"IF(COUNTA(F20:T20)=0,\"\",_xlfn.LET(_xlpm.h,CHOOSE({1,2,3,4,5},F20,I20,L20,O20,R20),_xlpm.a,CHOOSE({1,2,3,4,5},H20,K20,N20,Q20,T20),SUM((_xlpm.a>_xlpm.h)*(_xlpm.h<>\"\")*(_xlpm.a<>\"\"))))","v":0},{"$f":"IF(OR(V20=\"\",X20=\"\"),\"\",IF(MAX(V20,X20)<3,\"\",SUMPRODUCT(--($V$13:V20>$X$13:X20),--(($V$13:V20>=3)+($X$13:X20>=3)>0))))","v":""},":",{"$f":"IF(OR(V20=\"\",X20=\"\"),\"\",IF(MAX(V20,X20)<3,\"\",SUMPRODUCT(--($X$13:X20>$V$13:V20),--(($V$13:V20>=3)+($X$13:X20>=3)>0))))","v":""}]
[]
[null,{"$f":"B4","v":"BUZET 2"},":",null,{"$f":"E4","v":"MAESTRAL 2"},{"$f":"MAX(Y13:Y20)","v":4},":",{"$f":"MAX(AA13:AA20)","v":0}]
[null,null,null,null,"SETOVI",{"$f":"SUM(V13:V20)","v":12},":",{"$f":"SUM(X13:X20)","v":4}]
[null,null,null,null,"POENI",{"$f":"SUM(F13:F20, I13:I20, L13:L20, O13:O20, R13:R20)","v":168},":",{"$f":"SUM(H13:H20, K13:K20, N13:N20, Q13:Q20, T13:T20)","v":141}]

{"sheet":"ZAPISNIK_3_4","index":15,"n_rows":24,"n_cols":48,"rows_kept":24,"cut":false,"hidden":true,"merged":[[2,23,2,27],[0,0,0,27],[1,1,1,3],[1,4,1,8],[1,9,1,12],[1,13,1,18],[1,19,1,22],[1,23,1,27],[2,1,2,3],[2,4,2,8],[2,9,2,12],[2,13,2,18],[2,19,2,22]]}
["ŽUPANIJSKA LIGA STSIŽ 2025./2026.",null,null,null,null,null,null,null,null,null,null,null,null,null,null,null,null,null,null,null,null,null,null,null,null,null,null,null,null,null,null,null,null,null,null,null,null,null,null,null,null,null,null,null,null,null,null,"EDIT"]
[null,"GRAD DOMAĆIN",null,null,"DVORANA",null,null,null,null,"KOLO",null,null,null,"DATUM",null,null,null,null,null,"SAT"]
[null,"BUZET",null,null,"SD Buzet",null,null,null,null,"3.",null,null,null,"12. 11. 2025.",null,null,null,null,null,"18:00:00"]
["Domaćin","BUZET 1",null,"Gost","MAESTRAL 2"]
["A","BERDNYK Stanislav",null,"X","KMET Teo"]
["B","SIROTIĆ Kevin",null,"Y","VIŽINTIN Marino"]
["C","SIROTIĆ Aleš",null,"Z","SINČIĆ Luana",null,null,null,null,null," "]
["R1",null,null,"R1"]
["R2",null,null,"R2"]
[]
[null,"DOMAĆIN",null,null,"GOST"]
[null,"BUZET 1",null,null,"MAESTRAL 2"]
[null,"BERDNYK Stanislav","A","X","KMET Teo",11,":",6,11,":",1,11,":",3,null,":",null,null,":",null,null,{"$f":"IF(COUNTA(F13:T13)=0,\"\",_xlfn.LET(_xlpm.h,CHOOSE({1,2,3,4,5},F13,I13,L13,O13,R13),_xlpm.a,CHOOSE({1,2,3,4,5},H13,K13,N13,Q13,T13),SUM((_xlpm.h>_xlpm.a)*(_xlpm.h<>\"\")*(_xlpm.a<>\"\"))))","v":3},":",{"$f":"IF(COUNTA(F13:T13)=0,\"\",_xlfn.LET(_xlpm.h,CHOOSE({1,2,3,4,5},F13,I13,L13,O13,R13),_xlpm.a,CHOOSE({1,2,3,4,5},H13,K13,N13,Q13,T13),SUM((_xlpm.a>_xlpm.h)*(_xlpm.h<>\"\")*(_xlpm.a<>\"\"))))","v":0},{"$f":"IF(OR(V13=\"\",X13=\"\"),\"\",IF(MAX(V13,X13)<3,\"\",SUMPRODUCT(--($V$13:V13>$X$13:X13),--(($V$13:V13>=3)+($X$13:X13>=3)>0))))","v":1},":",{"$f":"IF(OR(V13=\"\",X13=\"\"),\"\",IF(MAX(V13,X13)<3,\"\",SUMPRODUCT(--($X$13:X13>$V$13:V13),--(($V$13:V13>=3)+($X$13:X13>=3)>0))))","v":0}]
[null,"SIROTIĆ Kevin","B","Y","VIŽINTIN Marino",11,":",6,11,":",4,11,":",5,null,":",null,null,":",null,null,{"$f":"IF(COUNTA(F14:T14)=0,\"\",_xlfn.LET(_xlpm.h,CHOOSE({1,2,3,4,5},F14,I14,L14,O14,R14),_xlpm.a,CHOOSE({1,2,3,4,5},H14,K14,N14,Q14,T14),SUM((_xlpm.h>_xlpm.a)*(_xlpm.h<>\"\")*(_xlpm.a<>\"\"))))","v":3},":",{"$f":"IF(COUNTA(F14:T14)=0,\"\",_xlfn.LET(_xlpm.h,CHOOSE({1,2,3,4,5},F14,I14,L14,O14,R14),_xlpm.a,CHOOSE({1,2,3,4,5},H14,K14,N14,Q14,T14),SUM((_xlpm.a>_xlpm.h)*(_xlpm.h<>\"\")*(_xlpm.a<>\"\"))))","v":0},{"$f":"IF(OR(V14=\"\",X14=\"\"),\"\",IF(MAX(V14,X14)<3,\"\",SUMPRODUCT(--($V$13:V14>$X$13:X14),--(($V$13:V14>=3)+($X$13:X14>=3)>0))))","v":2},":",{"$f":"IF(OR(V14=\"\",X14=\"\"),\"\",IF(MAX(V14,X14)<3,\"\",SUMPRODUCT(--($X$13:X14>$V$13:V14),--(($V$13:V14>=3)+($X$13:X14>=3)>0))))","v":0}]
[null,"SIROTIĆ Aleš","C","Z","SINČIĆ Luana",11,":",8,11,":",6,12,":",10,null,":",null,null,":",null,null,{"$f":"IF(COUNTA(F15:T15)=0,\"\",_xlfn.LET(_xlpm.h,CHOOSE({1,2,3,4,5},F15,I15,L15,O15,R15),_xlpm.a,CHOOSE({1,2,3,4,5},H15,K15,N15,Q15,T15),SUM((_xlpm.h>_xlpm.a)*(_xlpm.h<>\"\")*(_xlpm.a<>\"\"))))","v":3},":",{"$f":"IF(COUNTA(F15:T15)=0,\"\",_xlfn.LET(_xlpm.h,CHOOSE({1,2,3,4,5},F15,I15,L15,O15,R15),_xlpm.a,CHOOSE({1,2,3,4,5},H15,K15,N15,Q15,T15),SUM((_xlpm.a>_xlpm.h)*(_xlpm.h<>\"\")*(_xlpm.a<>\"\"))))","v":0},{"$f":"IF(OR(V15=\"\",X15=\"\"),\"\",IF(MAX(V15,X15)<3,\"\",SUMPRODUCT(--($V$13:V15>$X$13:X15),--(($V$13:V15>=3)+($X$13:X15>=3)>0))))","v":3},":",{"$f":"IF(OR(V15=\"\",X15=\"\"),\"\",IF(MAX(V15,X15)<3,\"\",SUMPRODUCT(--($X$13:X15>$V$13:V15),--(($V$13:V15>=3)+($X$13:X15>=3)>0))))","v":0}]
[null,"SIROTIĆ K., BERDNYK S.","PAR","PAR","KMET T., SINČIĆ L.",11,":",7,11,":",4,11,":",6,null,":",null,null,":",null,null,{"$f":"IF(COUNTA(F16:T16)=0,\"\",_xlfn.LET(_xlpm.h,CHOOSE({1,2,3,4,5},F16,I16,L16,O16,R16),_xlpm.a,CHOOSE({1,2,3,4,5},H16,K16,N16,Q16,T16),SUM((_xlpm.h>_xlpm.a)*(_xlpm.h<>\"\")*(_xlpm.a<>\"\"))))","v":3},":",{"$f":"IF(COUNTA(F16:T16)=0,\"\",_xlfn.LET(_xlpm.h,CHOOSE({1,2,3,4,5},F16,I16,L16,O16,R16),_xlpm.a,CHOOSE({1,2,3,4,5},H16,K16,N16,Q16,T16),SUM((_xlpm.a>_xlpm.h)*(_xlpm.h<>\"\")*(_xlpm.a<>\"\"))))","v":0},{"$f":"IF(OR(V16=\"\",X16=\"\"),\"\",IF(MAX(V16,X16)<3,\"\",SUMPRODUCT(--($V$13:V16>$X$13:X16),--(($V$13:V16>=3)+($X$13:X16>=3)>0))))","v":4},":",{"$f":"IF(OR(V16=\"\",X16=\"\"),\"\",IF(MAX(V16,X16)<3,\"\",SUMPRODUCT(--($X$13:X16>$V$13:V16),--(($V$13:V16>=3)+($X$13:X16>=3)>0))))","v":0}]
[null,null,null,null,null,null,":",null,null,":",null,null,":",null,null,":",null,null,":",null,null,{"$f":"IF(COUNTA(F17:T17)=0,\"\",_xlfn.LET(_xlpm.h,CHOOSE({1,2,3,4,5},F17,I17,L17,O17,R17),_xlpm.a,CHOOSE({1,2,3,4,5},H17,K17,N17,Q17,T17),SUM((_xlpm.h>_xlpm.a)*(_xlpm.h<>\"\")*(_xlpm.a<>\"\"))))","v":0},":",{"$f":"IF(COUNTA(F17:T17)=0,\"\",_xlfn.LET(_xlpm.h,CHOOSE({1,2,3,4,5},F17,I17,L17,O17,R17),_xlpm.a,CHOOSE({1,2,3,4,5},H17,K17,N17,Q17,T17),SUM((_xlpm.a>_xlpm.h)*(_xlpm.h<>\"\")*(_xlpm.a<>\"\"))))","v":0},{"$f":"IF(OR(V17=\"\",X17=\"\"),\"\",IF(MAX(V17,X17)<3,\"\",SUMPRODUCT(--($V$13:V17>$X$13:X17),--(($V$13:V17>=3)+($X$13:X17>=3)>0))))","v":""},":",{"$f":"IF(OR(V17=\"\",X17=\"\"),\"\",IF(MAX(V17,X17)<3,\"\",SUMPRODUCT(--($X$13:X17>$V$13:V17),--(($V$13:V17>=3)+($X$13:X17>=3)>0))))","v":""}]
[null,null,"A","Y",null,null,":",null,null,":",null,null,":",null,null,":",null,null,":",null,null,{"$f":"IF(COUNTA(F18:T18)=0,\"\",_xlfn.LET(_xlpm.h,CHOOSE({1,2,3,4,5},F18,I18,L18,O18,R18),_xlpm.a,CHOOSE({1,2,3,4,5},H18,K18,N18,Q18,T18),SUM((_xlpm.h>_xlpm.a)*(_xlpm.h<>\"\")*(_xlpm.a<>\"\"))))","v":0},":",{"$f":"IF(COUNTA(F18:T18)=0,\"\",_xlfn.LET(_xlpm.h,CHOOSE({1,2,3,4,5},F18,I18,L18,O18,R18),_xlpm.a,CHOOSE({1,2,3,4,5},H18,K18,N18,Q18,T18),SUM((_xlpm.a>_xlpm.h)*(_xlpm.h<>\"\")*(_xlpm.a<>\"\"))))","v":0},{"$f":"IF(OR(V18=\"\",X18=\"\"),\"\",IF(MAX(V18,X18)<3,\"\",SUMPRODUCT(--($V$13:V18>$X$13:X18),--(($V$13:V18>=3)+($X$13:X18>=3)>0))))","v":""},":",{"$f":"IF(OR(V18=\"\",X18=\"\"),\"\",IF(MAX(V18,X18)<3,\"\",SUMPRODUCT(--($X$13:X18>$V$13:V18),--(($V$13:V18>=3)+($X$13:X18>=3)>0))))","v":""}]
[null,null,"C","X",null,null,":",null,null,":",null,null,":",null,null,":",null,null,":",null,null,{"$f":"IF(COUNTA(F19:T19)=0,\"\",_xlfn.LET(_xlpm.h,CHOOSE({1,2,3,4,5},F19,I19,L19,O19,R19),_xlpm.a,CHOOSE({1,2,3,4,5},H19,K19,N19,Q19,T19),SUM((_xlpm.h>_xlpm.a)*(_xlpm.h<>\"\")*(_xlpm.a<>\"\"))))","v":0},":",{"$f":"IF(COUNTA(F19:T19)=0,\"\",_xlfn.LET(_xlpm.h,CHOOSE({1,2,3,4,5},F19,I19,L19,O19,R19),_xlpm.a,CHOOSE({1,2,3,4,5},H19,K19,N19,Q19,T19),SUM((_xlpm.a>_xlpm.h)*(_xlpm.h<>\"\")*(_xlpm.a<>\"\"))))","v":0},{"$f":"IF(OR(V19=\"\",X19=\"\"),\"\",IF(MAX(V19,X19)<3,\"\",SUMPRODUCT(--($V$13:V19>$X$13:X19),--(($V$13:V19>=3)+($X$13:X19>=3)>0))))","v":""},":",{"$f":"IF(OR(V19=\"\",X19=\"\"),\"\",IF(MAX(V19,X19)<3,\"\",SUMPRODUCT(--($X$13:X19>$V$13:V19),--(($V$13:V19>=3)+($X$13:X19>=3)>0))))","v":""}]
[null,null,"B","Z",null,null,":",null,null,":",null,null,":",null,null,":",null,null,":",null,null,{"$f":"IF(COUNTA(F20:T20)=0,\"\",_xlfn.LET(_xlpm.h,CHOOSE({1,2,3,4,5},F20,I20,L20,O20,R20),_xlpm.a,CHOOSE({1,2,3,4,5},H20,K20,N20,Q20,T20),SUM((_xlpm.h>_xlpm.a)*(_xlpm.h<>\"\")*(_xlpm.a<>\"\"))))","v":0},":",{"$f":"IF(COUNTA(F20:T20)=0,\"\",_xlfn.LET(_xlpm.h,CHOOSE({1,2,3,4,5},F20,I20,L20,O20,R20),_xlpm.a,CHOOSE({1,2,3,4,5},H20,K20,N20,Q20,T20),SUM((_xlpm.a>_xlpm.h)*(_xlpm.h<>\"\")*(_xlpm.a<>\"\"))))","v":0},{"$f":"IF(OR(V20=\"\",X20=\"\"),\"\",IF(MAX(V20,X20)<3,\"\",SUMPRODUCT(--($V$13:V20>$X$13:X20),--(($V$13:V20>=3)+($X$13:X20>=3)>0))))","v":""},":",{"$f":"IF(OR(V20=\"\",X20=\"\"),\"\",IF(MAX(V20,X20)<3,\"\",SUMPRODUCT(--($X$13:X20>$V$13:V20),--(($V$13:V20>=3)+($X$13:X20>=3)>0))))","v":""}]
[]
[null,{"$f":"B4","v":"BUZET 1"},":",null,{"$f":"E4","v":"MAESTRAL 2"},{"$f":"MAX(Y13:Y20)","v":4},":",{"$f":"MAX(AA13:AA20)","v":0}]
[null,null,null,null,"SETOVI",{"$f":"SUM(V13:V20)","v":12},":",{"$f":"SUM(X13:X20)","v":0}]
[null,null,null,null,"POENI",{"$f":"SUM(F13:F20, I13:I20, L13:L20, O13:O20, R13:R20)","v":133},":",{"$f":"SUM(H13:H20, K13:K20, N13:N20, Q13:Q20, T13:T20)","v":66}]

{"sheet":"ZAPISNIK_4_1","index":16,"n_rows":24,"n_cols":48,"rows_kept":24,"cut":false,"hidden":true,"merged":[[2,23,2,27],[0,0,0,27],[1,1,1,3],[1,4,1,8],[1,9,1,12],[1,13,1,18],[1,19,1,22],[1,23,1,27],[2,1,2,3],[2,4,2,8],[2,9,2,12],[2,13,2,18],[2,19,2,22]]}
["ŽUPANIJSKA LIGA STSIŽ 2025./2026",null,null,null,null,null,null,null,null,null,null,null,null,null,null,null,null,null,null,null,null,null,null,null,null,null,null,null,null,null,null,null,null,null,null,null,null,null,null,null,null,null,null,null,null,null,null,"EDIT"]
[null,"GRAD DOMAĆIN",null,null,"DVORANA",null,null,null,null,"KOLO",null,null,null,"DATUM",null,null,null,null,null,"SAT"]
[null,"PULA",null,null,"Dvorana STK Arena Ferro, Rojc",null,null,null,null,"4.",null,null,null,"19. 11. 2025.",null,null,null,null,null,"18:30:00"]
["Domaćin","ARENA FERRO",null,"Gost","BUZET 1"]
["A","CINKOPAN Kristijan",null,"X","BERDNYK Stanislav"]
["B","KRIŠTO Tomislav",null,"Y","SIROTIĆ Aleš"]
["C","KRANJC Dino",null,"Z","KRANČIĆ Filip",null,null,null,null,null," "]
["R1",null,null,"R1"]
["R2",null,null,"R2"]
[]
[null,"DOMAĆIN",null,null,"GOST"]
[null,"ARENA FERRO",null,null,"BUZET 1"]
[null,"CINKOPAN Kristijan","A","X","BERDNYK Stanislav",11,":",9,11,":",3,11,":",6,null,":",null,null,":",null,null,{"$f":"IF(COUNTA(F13:T13)=0,\"\",_xlfn.LET(_xlpm.h,CHOOSE({1,2,3,4,5},F13,I13,L13,O13,R13),_xlpm.a,CHOOSE({1,2,3,4,5},H13,K13,N13,Q13,T13),SUM((_xlpm.h>_xlpm.a)*(_xlpm.h<>\"\")*(_xlpm.a<>\"\"))))","v":3},":",{"$f":"IF(COUNTA(F13:T13)=0,\"\",_xlfn.LET(_xlpm.h,CHOOSE({1,2,3,4,5},F13,I13,L13,O13,R13),_xlpm.a,CHOOSE({1,2,3,4,5},H13,K13,N13,Q13,T13),SUM((_xlpm.a>_xlpm.h)*(_xlpm.h<>\"\")*(_xlpm.a<>\"\"))))","v":0},{"$f":"IF(OR(V13=\"\",X13=\"\"),\"\",IF(MAX(V13,X13)<3,\"\",SUMPRODUCT(--($V$13:V13>$X$13:X13),--(($V$13:V13>=3)+($X$13:X13>=3)>0))))","v":1},":",{"$f":"IF(OR(V13=\"\",X13=\"\"),\"\",IF(MAX(V13,X13)<3,\"\",SUMPRODUCT(--($X$13:X13>$V$13:V13),--(($V$13:V13>=3)+($X$13:X13>=3)>0))))","v":0}]
[null,"KRIŠTO Tomislav","B","Y","SIROTIĆ Aleš",11,":",9,12,":",10,11,":",6,null,":",null,null,":",null,null,{"$f":"IF(COUNTA(F14:T14)=0,\"\",_xlfn.LET(_xlpm.h,CHOOSE({1,2,3,4,5},F14,I14,L14,O14,R14),_xlpm.a,CHOOSE({1,2,3,4,5},H14,K14,N14,Q14,T14),SUM((_xlpm.h>_xlpm.a)*(_xlpm.h<>\"\")*(_xlpm.a<>\"\"))))","v":3},":",{"$f":"IF(COUNTA(F14:T14)=0,\"\",_xlfn.LET(_xlpm.h,CHOOSE({1,2,3,4,5},F14,I14,L14,O14,R14),_xlpm.a,CHOOSE({1,2,3,4,5},H14,K14,N14,Q14,T14),SUM((_xlpm.a>_xlpm.h)*(_xlpm.h<>\"\")*(_xlpm.a<>\"\"))))","v":0},{"$f":"IF(OR(V14=\"\",X14=\"\"),\"\",IF(MAX(V14,X14)<3,\"\",SUMPRODUCT(--($V$13:V14>$X$13:X14),--(($V$13:V14>=3)+($X$13:X14>=3)>0))))","v":2},":",{"$f":"IF(OR(V14=\"\",X14=\"\"),\"\",IF(MAX(V14,X14)<3,\"\",SUMPRODUCT(--($X$13:X14>$V$13:V14),--(($V$13:V14>=3)+($X$13:X14>=3)>0))))","v":0}]
[null,"KRANJC Dino","C","Z","KRANČIĆ Filip",9,":",11,11,":",6,11,":",8,7,":",11,11,":",13,null,{"$f":"IF(COUNTA(F15:T15)=0,\"\",_xlfn.LET(_xlpm.h,CHOOSE({1,2,3,4,5},F15,I15,L15,O15,R15),_xlpm.a,CHOOSE({1,2,3,4,5},H15,K15,N15,Q15,T15),SUM((_xlpm.h>_xlpm.a)*(_xlpm.h<>\"\")*(_xlpm.a<>\"\"))))","v":2},":",{"$f":"IF(COUNTA(F15:T15)=0,\"\",_xlfn.LET(_xlpm.h,CHOOSE({1,2,3,4,5},F15,I15,L15,O15,R15),_xlpm.a,CHOOSE({1,2,3,4,5},H15,K15,N15,Q15,T15),SUM((_xlpm.a>_xlpm.h)*(_xlpm.h<>\"\")*(_xlpm.a<>\"\"))))","v":3},{"$f":"IF(OR(V15=\"\",X15=\"\"),\"\",IF(MAX(V15,X15)<3,\"\",SUMPRODUCT(--($V$13:V15>$X$13:X15),--(($V$13:V15>=3)+($X$13:X15>=3)>0))))","v":2},":",{"$f":"IF(OR(V15=\"\",X15=\"\"),\"\",IF(MAX(V15,X15)<3,\"\",SUMPRODUCT(--($X$13:X15>$V$13:V15),--(($V$13:V15>=3)+($X$13:X15>=3)>0))))","v":1}]
[null,"CINKOPAN K., KRANJC D.","PAR","PAR","SIROTIĆ A., KRANČIĆ F.",11,":",6,16,":",14,8,":",11,11,":",5,null,":",null,null,{"$f":"IF(COUNTA(F16:T16)=0,\"\",_xlfn.LET(_xlpm.h,CHOOSE({1,2,3,4,5},F16,I16,L16,O16,R16),_xlpm.a,CHOOSE({1,2,3,4,5},H16,K16,N16,Q16,T16),SUM((_xlpm.h>_xlpm.a)*(_xlpm.h<>\"\")*(_xlpm.a<>\"\"))))","v":3},":",{"$f":"IF(COUNTA(F16:T16)=0,\"\",_xlfn.LET(_xlpm.h,CHOOSE({1,2,3,4,5},F16,I16,L16,O16,R16),_xlpm.a,CHOOSE({1,2,3,4,5},H16,K16,N16,Q16,T16),SUM((_xlpm.a>_xlpm.h)*(_xlpm.h<>\"\")*(_xlpm.a<>\"\"))))","v":1},{"$f":"IF(OR(V16=\"\",X16=\"\"),\"\",IF(MAX(V16,X16)<3,\"\",SUMPRODUCT(--($V$13:V16>$X$13:X16),--(($V$13:V16>=3)+($X$13:X16>=3)>0))))","v":3},":",{"$f":"IF(OR(V16=\"\",X16=\"\"),\"\",IF(MAX(V16,X16)<3,\"\",SUMPRODUCT(--($X$13:X16>$V$13:V16),--(($V$13:V16>=3)+($X$13:X16>=3)>0))))","v":1}]
[null,null,null,null,null,null,":",null,null,":",null,null,":",null,null,":",null,null,":",null,null,{"$f":"IF(COUNTA(F17:T17)=0,\"\",_xlfn.LET(_xlpm.h,CHOOSE({1,2,3,4,5},F17,I17,L17,O17,R17),_xlpm.a,CHOOSE({1,2,3,4,5},H17,K17,N17,Q17,T17),SUM((_xlpm.h>_xlpm.a)*(_xlpm.h<>\"\")*(_xlpm.a<>\"\"))))","v":0},":",{"$f":"IF(COUNTA(F17:T17)=0,\"\",_xlfn.LET(_xlpm.h,CHOOSE({1,2,3,4,5},F17,I17,L17,O17,R17),_xlpm.a,CHOOSE({1,2,3,4,5},H17,K17,N17,Q17,T17),SUM((_xlpm.a>_xlpm.h)*(_xlpm.h<>\"\")*(_xlpm.a<>\"\"))))","v":0},{"$f":"IF(OR(V17=\"\",X17=\"\"),\"\",IF(MAX(V17,X17)<3,\"\",SUMPRODUCT(--($V$13:V17>$X$13:X17),--(($V$13:V17>=3)+($X$13:X17>=3)>0))))","v":""},":",{"$f":"IF(OR(V17=\"\",X17=\"\"),\"\",IF(MAX(V17,X17)<3,\"\",SUMPRODUCT(--($X$13:X17>$V$13:V17),--(($V$13:V17>=3)+($X$13:X17>=3)>0))))","v":""}]
[null,"CINKOPAN Kristijan","A","Y","SIROTIĆ Aleš",11,":",7,14,":",12,11,":",4,null,":",null,null,":",null,null,{"$f":"IF(COUNTA(F18:T18)=0,\"\",_xlfn.LET(_xlpm.h,CHOOSE({1,2,3,4,5},F18,I18,L18,O18,R18),_xlpm.a,CHOOSE({1,2,3,4,5},H18,K18,N18,Q18,T18),SUM((_xlpm.h>_xlpm.a)*(_xlpm.h<>\"\")*(_xlpm.a<>\"\"))))","v":3},":",{"$f":"IF(COUNTA(F18:T18)=0,\"\",_xlfn.LET(_xlpm.h,CHOOSE({1,2,3,4,5},F18,I18,L18,O18,R18),_xlpm.a,CHOOSE({1,2,3,4,5},H18,K18,N18,Q18,T18),SUM((_xlpm.a>_xlpm.h)*(_xlpm.h<>\"\")*(_xlpm.a<>\"\"))))","v":0},{"$f":"IF(OR(V18=\"\",X18=\"\"),\"\",IF(MAX(V18,X18)<3,\"\",SUMPRODUCT(--($V$13:V18>$X$13:X18),--(($V$13:V18>=3)+($X$13:X18>=3)>0))))","v":4},":",{"$f":"IF(OR(V18=\"\",X18=\"\"),\"\",IF(MAX(V18,X18)<3,\"\",SUMPRODUCT(--($X$13:X18>$V$13:V18),--(($V$13:V18>=3)+($X$13:X18>=3)>0))))","v":1}]
[null,null,"C","X",null,null,":",null,null,":",null,null,":",null,null,":",null,null,":",null,null,{"$f":"IF(COUNTA(F19:T19)=0,\"\",_xlfn.LET(_xlpm.h,CHOOSE({1,2,3,4,5},F19,I19,L19,O19,R19),_xlpm.a,CHOOSE({1,2,3,4,5},H19,K19,N19,Q19,T19),SUM((_xlpm.h>_xlpm.a)*(_xlpm.h<>\"\")*(_xlpm.a<>\"\"))))","v":0},":",{"$f":"IF(COUNTA(F19:T19)=0,\"\",_xlfn.LET(_xlpm.h,CHOOSE({1,2,3,4,5},F19,I19,L19,O19,R19),_xlpm.a,CHOOSE({1,2,3,4,5},H19,K19,N19,Q19,T19),SUM((_xlpm.a>_xlpm.h)*(_xlpm.h<>\"\")*(_xlpm.a<>\"\"))))","v":0},{"$f":"IF(OR(V19=\"\",X19=\"\"),\"\",IF(MAX(V19,X19)<3,\"\",SUMPRODUCT(--($V$13:V19>$X$13:X19),--(($V$13:V19>=3)+($X$13:X19>=3)>0))))","v":""},":",{"$f":"IF(OR(V19=\"\",X19=\"\"),\"\",IF(MAX(V19,X19)<3,\"\",SUMPRODUCT(--($X$13:X19>$V$13:V19),--(($V$13:V19>=3)+($X$13:X19>=3)>0))))","v":""}]
[null,null,"B","Z",null,null,":",null,null,":",null,null,":",null,null,":",null,null,":",null,null,{"$f":"IF(COUNTA(F20:T20)=0,\"\",_xlfn.LET(_xlpm.h,CHOOSE({1,2,3,4,5},F20,I20,L20,O20,R20),_xlpm.a,CHOOSE({1,2,3,4,5},H20,K20,N20,Q20,T20),SUM((_xlpm.h>_xlpm.a)*(_xlpm.h<>\"\")*(_xlpm.a<>\"\"))))","v":0},":",{"$f":"IF(COUNTA(F20:T20)=0,\"\",_xlfn.LET(_xlpm.h,CHOOSE({1,2,3,4,5},F20,I20,L20,O20,R20),_xlpm.a,CHOOSE({1,2,3,4,5},H20,K20,N20,Q20,T20),SUM((_xlpm.a>_xlpm.h)*(_xlpm.h<>\"\")*(_xlpm.a<>\"\"))))","v":0},{"$f":"IF(OR(V20=\"\",X20=\"\"),\"\",IF(MAX(V20,X20)<3,\"\",SUMPRODUCT(--($V$13:V20>$X$13:X20),--(($V$13:V20>=3)+($X$13:X20>=3)>0))))","v":""},":",{"$f":"IF(OR(V20=\"\",X20=\"\"),\"\",IF(MAX(V20,X20)<3,\"\",SUMPRODUCT(--($X$13:X20>$V$13:V20),--(($V$13:V20>=3)+($X$13:X20>=3)>0))))","v":""}]
[]
[null,{"$f":"B4","v":"ARENA FERRO"},":",null,{"$f":"E4","v":"BUZET 1"},{"$f":"MAX(Y13:Y20)","v":4},":",{"$f":"MAX(AA13:AA20)","v":1}]
[null,null,null,null,"SETOVI",{"$f":"SUM(V13:V20)","v":14},":",{"$f":"SUM(X13:X20)","v":4}]
[null,null,null,null,"POENI",{"$f":"SUM(F13:F20, I13:I20, L13:L20, O13:O20, R13:R20)","v":198},":",{"$f":"SUM(H13:H20, K13:K20, N13:N20, Q13:Q20, T13:T20)","v":151}]

{"sheet":"ZAPISNIK_4_2","index":17,"n_rows":24,"n_cols":48,"rows_kept":24,"cut":false,"hidden":true,"merged":[[2,23,2,27],[0,0,0,27],[1,1,1,3],[1,4,1,8],[1,9,1,12],[1,13,1,18],[1,19,1,22],[1,23,1,27],[2,1,2,3],[2,4,2,8],[2,9,2,12],[2,13,2,18],[2,19,2,22]]}
["ŽUPANIJSKA LIGA STSIŽ 2025./2026",null,null,null,null,null,null,null,null,null,null,null,null,null,null,null,null,null,null,null,null,null,null,null,null,null,null,null,null,null,null,null,null,null,null,null,null,null,null,null,null,null,null,null,null,null,null,"EDIT"]
[null,"GRAD DOMAĆIN",null,null,"DVORANA",null,null,null,null,"KOLO",null,null,null,"DATUM",null,null,null,null,null,"SAT"]
[null,"PULA",null,null,"Dvorana STK Arena Ferro, Rojc",null,null,null,null,"4.",null,null,null,"19. 11. 2025.",null,null,null,null,null,"17:00:00"]
["Domaćin","ARENA FERRO",null,"Gost","BUZET 2"]
["A","VALE Damir",null,"X","BOŠNJAKOVIĆ Dubravko"]
["B","KRANJC Dino",null,"Y","DRAŠĆIĆ Petar"]
["C","KRIŠTO Tomislav",null,"Z","PAVLETIĆ Guido",null,null,null,null,null," "]
["R1",null,null,"R1"]
["R2",null,null,"R2"]
[]
[null,"DOMAĆIN",null,null,"GOST"]
[null,"ARENA FERRO",null,null,"BUZET 2"]
[null,"VALE Damir","A","X","BOŠNJAKOVIĆ Dubravko",7,":",11,11,":",7,9,":",11,11,":",7,11,":",7,null,{"$f":"IF(COUNTA(F13:T13)=0,\"\",_xlfn.LET(_xlpm.h,CHOOSE({1,2,3,4,5},F13,I13,L13,O13,R13),_xlpm.a,CHOOSE({1,2,3,4,5},H13,K13,N13,Q13,T13),SUM((_xlpm.h>_xlpm.a)*(_xlpm.h<>\"\")*(_xlpm.a<>\"\"))))","v":3},":",{"$f":"IF(COUNTA(F13:T13)=0,\"\",_xlfn.LET(_xlpm.h,CHOOSE({1,2,3,4,5},F13,I13,L13,O13,R13),_xlpm.a,CHOOSE({1,2,3,4,5},H13,K13,N13,Q13,T13),SUM((_xlpm.a>_xlpm.h)*(_xlpm.h<>\"\")*(_xlpm.a<>\"\"))))","v":2},{"$f":"IF(OR(V13=\"\",X13=\"\"),\"\",IF(MAX(V13,X13)<3,\"\",SUMPRODUCT(--($V$13:V13>$X$13:X13),--(($V$13:V13>=3)+($X$13:X13>=3)>0))))","v":1},":",{"$f":"IF(OR(V13=\"\",X13=\"\"),\"\",IF(MAX(V13,X13)<3,\"\",SUMPRODUCT(--($X$13:X13>$V$13:V13),--(($V$13:V13>=3)+($X$13:X13>=3)>0))))","v":0}]
[null,"KRANJC Dino","B","Y","DRAŠĆIĆ Petar",11,":",9,11,":",7,11,":",9,null,":",null,null,":",null,null,{"$f":"IF(COUNTA(F14:T14)=0,\"\",_xlfn.LET(_xlpm.h,CHOOSE({1,2,3,4,5},F14,I14,L14,O14,R14),_xlpm.a,CHOOSE({1,2,3,4,5},H14,K14,N14,Q14,T14),SUM((_xlpm.h>_xlpm.a)*(_xlpm.h<>\"\")*(_xlpm.a<>\"\"))))","v":3},":",{"$f":"IF(COUNTA(F14:T14)=0,\"\",_xlfn.LET(_xlpm.h,CHOOSE({1,2,3,4,5},F14,I14,L14,O14,R14),_xlpm.a,CHOOSE({1,2,3,4,5},H14,K14,N14,Q14,T14),SUM((_xlpm.a>_xlpm.h)*(_xlpm.h<>\"\")*(_xlpm.a<>\"\"))))","v":0},{"$f":"IF(OR(V14=\"\",X14=\"\"),\"\",IF(MAX(V14,X14)<3,\"\",SUMPRODUCT(--($V$13:V14>$X$13:X14),--(($V$13:V14>=3)+($X$13:X14>=3)>0))))","v":2},":",{"$f":"IF(OR(V14=\"\",X14=\"\"),\"\",IF(MAX(V14,X14)<3,\"\",SUMPRODUCT(--($X$13:X14>$V$13:V14),--(($V$13:V14>=3)+($X$13:X14>=3)>0))))","v":0}]
[null,"KRIŠTO Tomislav","C","Z","PAVLETIĆ Guido",11,":",7,11,":",3,11,":",6,null,":",null,null,":",null,null,{"$f":"IF(COUNTA(F15:T15)=0,\"\",_xlfn.LET(_xlpm.h,CHOOSE({1,2,3,4,5},F15,I15,L15,O15,R15),_xlpm.a,CHOOSE({1,2,3,4,5},H15,K15,N15,Q15,T15),SUM((_xlpm.h>_xlpm.a)*(_xlpm.h<>\"\")*(_xlpm.a<>\"\"))))","v":3},":",{"$f":"IF(COUNTA(F15:T15)=0,\"\",_xlfn.LET(_xlpm.h,CHOOSE({1,2,3,4,5},F15,I15,L15,O15,R15),_xlpm.a,CHOOSE({1,2,3,4,5},H15,K15,N15,Q15,T15),SUM((_xlpm.a>_xlpm.h)*(_xlpm.h<>\"\")*(_xlpm.a<>\"\"))))","v":0},{"$f":"IF(OR(V15=\"\",X15=\"\"),\"\",IF(MAX(V15,X15)<3,\"\",SUMPRODUCT(--($V$13:V15>$X$13:X15),--(($V$13:V15>=3)+($X$13:X15>=3)>0))))","v":3},":",{"$f":"IF(OR(V15=\"\",X15=\"\"),\"\",IF(MAX(V15,X15)<3,\"\",SUMPRODUCT(--($X$13:X15>$V$13:V15),--(($V$13:V15>=3)+($X$13:X15>=3)>0))))","v":0}]
[null,"KELEMEN M., KRANJC D.","PAR","PAR","DRAŠĆIĆ P., PAVLETIĆ G.",11,":",6,11,":",7,11,":",9,null,":",null,null,":",null,null,{"$f":"IF(COUNTA(F16:T16)=0,\"\",_xlfn.LET(_xlpm.h,CHOOSE({1,2,3,4,5},F16,I16,L16,O16,R16),_xlpm.a,CHOOSE({1,2,3,4,5},H16,K16,N16,Q16,T16),SUM((_xlpm.h>_xlpm.a)*(_xlpm.h<>\"\")*(_xlpm.a<>\"\"))))","v":3},":",{"$f":"IF(COUNTA(F16:T16)=0,\"\",_xlfn.LET(_xlpm.h,CHOOSE({1,2,3,4,5},F16,I16,L16,O16,R16),_xlpm.a,CHOOSE({1,2,3,4,5},H16,K16,N16,Q16,T16),SUM((_xlpm.a>_xlpm.h)*(_xlpm.h<>\"\")*(_xlpm.a<>\"\"))))","v":0},{"$f":"IF(OR(V16=\"\",X16=\"\"),\"\",IF(MAX(V16,X16)<3,\"\",SUMPRODUCT(--($V$13:V16>$X$13:X16),--(($V$13:V16>=3)+($X$13:X16>=3)>0))))","v":4},":",{"$f":"IF(OR(V16=\"\",X16=\"\"),\"\",IF(MAX(V16,X16)<3,\"\",SUMPRODUCT(--($X$13:X16>$V$13:V16),--(($V$13:V16>=3)+($X$13:X16>=3)>0))))","v":0}]
[null,null,null,null,null,null,":",null,null,":",null,null,":",null,null,":",null,null,":",null,null,{"$f":"IF(COUNTA(F17:T17)=0,\"\",_xlfn.LET(_xlpm.h,CHOOSE({1,2,3,4,5},F17,I17,L17,O17,R17),_xlpm.a,CHOOSE({1,2,3,4,5},H17,K17,N17,Q17,T17),SUM((_xlpm.h>_xlpm.a)*(_xlpm.h<>\"\")*(_xlpm.a<>\"\"))))","v":0},":",{"$f":"IF(COUNTA(F17:T17)=0,\"\",_xlfn.LET(_xlpm.h,CHOOSE({1,2,3,4,5},F17,I17,L17,O17,R17),_xlpm.a,CHOOSE({1,2,3,4,5},H17,K17,N17,Q17,T17),SUM((_xlpm.a>_xlpm.h)*(_xlpm.h<>\"\")*(_xlpm.a<>\"\"))))","v":0},{"$f":"IF(OR(V17=\"\",X17=\"\"),\"\",IF(MAX(V17,X17)<3,\"\",SUMPRODUCT(--($V$13:V17>$X$13:X17),--(($V$13:V17>=3)+($X$13:X17>=3)>0))))","v":""},":",{"$f":"IF(OR(V17=\"\",X17=\"\"),\"\",IF(MAX(V17,X17)<3,\"\",SUMPRODUCT(--($X$13:X17>$V$13:V17),--(($V$13:V17>=3)+($X$13:X17>=3)>0))))","v":""}]
[null,null,"A","Y",null,null,":",null,null,":",null,null,":",null,null,":",null,null,":",null,null,{"$f":"IF(COUNTA(F18:T18)=0,\"\",_xlfn.LET(_xlpm.h,CHOOSE({1,2,3,4,5},F18,I18,L18,O18,R18),_xlpm.a,CHOOSE({1,2,3,4,5},H18,K18,N18,Q18,T18),SUM((_xlpm.h>_xlpm.a)*(_xlpm.h<>\"\")*(_xlpm.a<>\"\"))))","v":0},":",{"$f":"IF(COUNTA(F18:T18)=0,\"\",_xlfn.LET(_xlpm.h,CHOOSE({1,2,3,4,5},F18,I18,L18,O18,R18),_xlpm.a,CHOOSE({1,2,3,4,5},H18,K18,N18,Q18,T18),SUM((_xlpm.a>_xlpm.h)*(_xlpm.h<>\"\")*(_xlpm.a<>\"\"))))","v":0},{"$f":"IF(OR(V18=\"\",X18=\"\"),\"\",IF(MAX(V18,X18)<3,\"\",SUMPRODUCT(--($V$13:V18>$X$13:X18),--(($V$13:V18>=3)+($X$13:X18>=3)>0))))","v":""},":",{"$f":"IF(OR(V18=\"\",X18=\"\"),\"\",IF(MAX(V18,X18)<3,\"\",SUMPRODUCT(--($X$13:X18>$V$13:V18),--(($V$13:V18>=3)+($X$13:X18>=3)>0))))","v":""}]
[null,null,"C","X",null,null,":",null,null,":",null,null,":",null,null,":",null,null,":",null,null,{"$f":"IF(COUNTA(F19:T19)=0,\"\",_xlfn.LET(_xlpm.h,CHOOSE({1,2,3,4,5},F19,I19,L19,O19,R19),_xlpm.a,CHOOSE({1,2,3,4,5},H19,K19,N19,Q19,T19),SUM((_xlpm.h>_xlpm.a)*(_xlpm.h<>\"\")*(_xlpm.a<>\"\"))))","v":0},":",{"$f":"IF(COUNTA(F19:T19)=0,\"\",_xlfn.LET(_xlpm.h,CHOOSE({1,2,3,4,5},F19,I19,L19,O19,R19),_xlpm.a,CHOOSE({1,2,3,4,5},H19,K19,N19,Q19,T19),SUM((_xlpm.a>_xlpm.h)*(_xlpm.h<>\"\")*(_xlpm.a<>\"\"))))","v":0},{"$f":"IF(OR(V19=\"\",X19=\"\"),\"\",IF(MAX(V19,X19)<3,\"\",SUMPRODUCT(--($V$13:V19>$X$13:X19),--(($V$13:V19>=3)+($X$13:X19>=3)>0))))","v":""},":",{"$f":"IF(OR(V19=\"\",X19=\"\"),\"\",IF(MAX(V19,X19)<3,\"\",SUMPRODUCT(--($X$13:X19>$V$13:V19),--(($V$13:V19>=3)+($X$13:X19>=3)>0))))","v":""}]
[null,null,"B","Z",null,null,":",null,null,":",null,null,":",null,null,":",null,null,":",null,null,{"$f":"IF(COUNTA(F20:T20)=0,\"\",_xlfn.LET(_xlpm.h,CHOOSE({1,2,3,4,5},F20,I20,L20,O20,R20),_xlpm.a,CHOOSE({1,2,3,4,5},H20,K20,N20,Q20,T20),SUM((_xlpm.h>_xlpm.a)*(_xlpm.h<>\"\")*(_xlpm.a<>\"\"))))","v":0},":",{"$f":"IF(COUNTA(F20:T20)=0,\"\",_xlfn.LET(_xlpm.h,CHOOSE({1,2,3,4,5},F20,I20,L20,O20,R20),_xlpm.a,CHOOSE({1,2,3,4,5},H20,K20,N20,Q20,T20),SUM((_xlpm.a>_xlpm.h)*(_xlpm.h<>\"\")*(_xlpm.a<>\"\"))))","v":0},{"$f":"IF(OR(V20=\"\",X20=\"\"),\"\",IF(MAX(V20,X20)<3,\"\",SUMPRODUCT(--($V$13:V20>$X$13:X20),--(($V$13:V20>=3)+($X$13:X20>=3)>0))))","v":""},":",{"$f":"IF(OR(V20=\"\",X20=\"\"),\"\",IF(MAX(V20,X20)<3,\"\",SUMPRODUCT(--($X$13:X20>$V$13:V20),--(($V$13:V20>=3)+($X$13:X20>=3)>0))))","v":""}]
[]
[null,{"$f":"B4","v":"ARENA FERRO"},":",null,{"$f":"E4","v":"BUZET 2"},{"$f":"MAX(Y13:Y20)","v":4},":",{"$f":"MAX(AA13:AA20)","v":0}]
[null,null,null,null,"SETOVI",{"$f":"SUM(V13:V20)","v":12},":",{"$f":"SUM(X13:X20)","v":2}]
[null,null,null,null,"POENI",{"$f":"SUM(F13:F20, I13:I20, L13:L20, O13:O20, R13:R20)","v":148},":",{"$f":"SUM(H13:H20, K13:K20, N13:N20, Q13:Q20, T13:T20)","v":106}]

{"sheet":"ZAPISNIK_4_3","index":18,"n_rows":24,"n_cols":48,"rows_kept":24,"cut":false,"hidden":true,"merged":[[2,23,2,27],[0,0,0,27],[1,1,1,3],[1,4,1,8],[1,9,1,12],[1,13,1,18],[1,19,1,22],[1,23,1,27],[2,1,2,3],[2,4,2,8],[2,9,2,12],[2,13,2,18],[2,19,2,22]]}
["ŽUPANIJSKA LIGA STSIŽ 2025./2026",null,null,null,null,null,null,null,null,null,null,null,null,null,null,null,null,null,null,null,null,null,null,null,null,null,null,null,null,null,null,null,null,null,null,null,null,null,null,null,null,null,null,null,null,null,null,"EDIT"]
[null,"GRAD DOMAĆIN",null,null,"DVORANA",null,null,null,null,"KOLO",null,null,null,"DATUM",null,null,null,null,null,"SAT"]
[null,"PULA",null,null,"MZ Gregovica, Pula",null,null,null,null,"4.",null,null,null,"4. 12. 2025.",null,null,null,null,null,"19:30:00"]
["Domaćin","VAL SHARK",null,"Gost","BUZET 2"]
["A","INFANTOLINO Davide",null,"X","KOS Dino"]
["B","IVINIĆ Serđo",null,"Y","DRAŠĆIĆ Petar"]
["C","DELEVIĆ Predrag",null,"Z","BOŠNJAKOVIĆ Dubravko",null,null,null,null,null," "]
["R1",null,null,"R1"]
["R2",null,null,"R2"]
[]
[null,"DOMAĆIN",null,null,"GOST"]
[null,"VAL SHARK",null,null,"BUZET 2"]
[null,"INFANTOLINO Davide","A","X","KOS Dino",11,":",5,11,":",6,11,":",6,null,":",null,null,":",null,null,{"$f":"IF(COUNTA(F13:T13)=0,\"\",_xlfn.LET(_xlpm.h,CHOOSE({1,2,3,4,5},F13,I13,L13,O13,R13),_xlpm.a,CHOOSE({1,2,3,4,5},H13,K13,N13,Q13,T13),SUM((_xlpm.h>_xlpm.a)*(_xlpm.h<>\"\")*(_xlpm.a<>\"\"))))","v":3},":",{"$f":"IF(COUNTA(F13:T13)=0,\"\",_xlfn.LET(_xlpm.h,CHOOSE({1,2,3,4,5},F13,I13,L13,O13,R13),_xlpm.a,CHOOSE({1,2,3,4,5},H13,K13,N13,Q13,T13),SUM((_xlpm.a>_xlpm.h)*(_xlpm.h<>\"\")*(_xlpm.a<>\"\"))))","v":0},{"$f":"IF(OR(V13=\"\",X13=\"\"),\"\",IF(MAX(V13,X13)<3,\"\",SUMPRODUCT(--($V$13:V13>$X$13:X13),--(($V$13:V13>=3)+($X$13:X13>=3)>0))))","v":1},":",{"$f":"IF(OR(V13=\"\",X13=\"\"),\"\",IF(MAX(V13,X13)<3,\"\",SUMPRODUCT(--($X$13:X13>$V$13:V13),--(($V$13:V13>=3)+($X$13:X13>=3)>0))))","v":0}]
[null,"IVINIĆ Serđo","B","Y","DRAŠĆIĆ Petar",11,":",4,11,":",7,11,":",8,null,":",null,null,":",null,null,{"$f":"IF(COUNTA(F14:T14)=0,\"\",_xlfn.LET(_xlpm.h,CHOOSE({1,2,3,4,5},F14,I14,L14,O14,R14),_xlpm.a,CHOOSE({1,2,3,4,5},H14,K14,N14,Q14,T14),SUM((_xlpm.h>_xlpm.a)*(_xlpm.h<>\"\")*(_xlpm.a<>\"\"))))","v":3},":",{"$f":"IF(COUNTA(F14:T14)=0,\"\",_xlfn.LET(_xlpm.h,CHOOSE({1,2,3,4,5},F14,I14,L14,O14,R14),_xlpm.a,CHOOSE({1,2,3,4,5},H14,K14,N14,Q14,T14),SUM((_xlpm.a>_xlpm.h)*(_xlpm.h<>\"\")*(_xlpm.a<>\"\"))))","v":0},{"$f":"IF(OR(V14=\"\",X14=\"\"),\"\",IF(MAX(V14,X14)<3,\"\",SUMPRODUCT(--($V$13:V14>$X$13:X14),--(($V$13:V14>=3)+($X$13:X14>=3)>0))))","v":2},":",{"$f":"IF(OR(V14=\"\",X14=\"\"),\"\",IF(MAX(V14,X14)<3,\"\",SUMPRODUCT(--($X$13:X14>$V$13:V14),--(($V$13:V14>=3)+($X$13:X14>=3)>0))))","v":0}]
[null,"DELEVIĆ Predrag","C","Z","BOŠNJAKOVIĆ Dubravko",11,":",5,11,":",2,11,":",4,null,":",null,null,":",null,null,{"$f":"IF(COUNTA(F15:T15)=0,\"\",_xlfn.LET(_xlpm.h,CHOOSE({1,2,3,4,5},F15,I15,L15,O15,R15),_xlpm.a,CHOOSE({1,2,3,4,5},H15,K15,N15,Q15,T15),SUM((_xlpm.h>_xlpm.a)*(_xlpm.h<>\"\")*(_xlpm.a<>\"\"))))","v":3},":",{"$f":"IF(COUNTA(F15:T15)=0,\"\",_xlfn.LET(_xlpm.h,CHOOSE({1,2,3,4,5},F15,I15,L15,O15,R15),_xlpm.a,CHOOSE({1,2,3,4,5},H15,K15,N15,Q15,T15),SUM((_xlpm.a>_xlpm.h)*(_xlpm.h<>\"\")*(_xlpm.a<>\"\"))))","v":0},{"$f":"IF(OR(V15=\"\",X15=\"\"),\"\",IF(MAX(V15,X15)<3,\"\",SUMPRODUCT(--($V$13:V15>$X$13:X15),--(($V$13:V15>=3)+($X$13:X15>=3)>0))))","v":3},":",{"$f":"IF(OR(V15=\"\",X15=\"\"),\"\",IF(MAX(V15,X15)<3,\"\",SUMPRODUCT(--($X$13:X15>$V$13:V15),--(($V$13:V15>=3)+($X$13:X15>=3)>0))))","v":0}]
[null,"DELEVIĆ P., IVINIĆ S.","PAR","PAR","DRAŠĆIĆ P., KOS D.",12,":",10,7,":",11,11,":",8,5,":",11,10,":",12,null,{"$f":"IF(COUNTA(F16:T16)=0,\"\",_xlfn.LET(_xlpm.h,CHOOSE({1,2,3,4,5},F16,I16,L16,O16,R16),_xlpm.a,CHOOSE({1,2,3,4,5},H16,K16,N16,Q16,T16),SUM((_xlpm.h>_xlpm.a)*(_xlpm.h<>\"\")*(_xlpm.a<>\"\"))))","v":2},":",{"$f":"IF(COUNTA(F16:T16)=0,\"\",_xlfn.LET(_xlpm.h,CHOOSE({1,2,3,4,5},F16,I16,L16,O16,R16),_xlpm.a,CHOOSE({1,2,3,4,5},H16,K16,N16,Q16,T16),SUM((_xlpm.a>_xlpm.h)*(_xlpm.h<>\"\")*(_xlpm.a<>\"\"))))","v":3},{"$f":"IF(OR(V16=\"\",X16=\"\"),\"\",IF(MAX(V16,X16)<3,\"\",SUMPRODUCT(--($V$13:V16>$X$13:X16),--(($V$13:V16>=3)+($X$13:X16>=3)>0))))","v":3},":",{"$f":"IF(OR(V16=\"\",X16=\"\"),\"\",IF(MAX(V16,X16)<3,\"\",SUMPRODUCT(--($X$13:X16>$V$13:V16),--(($V$13:V16>=3)+($X$13:X16>=3)>0))))","v":1}]
[null,null,null,null,null,null,":",null,null,":",null,null,":",null,null,":",null,null,":",null,null,{"$f":"IF(COUNTA(F17:T17)=0,\"\",_xlfn.LET(_xlpm.h,CHOOSE({1,2,3,4,5},F17,I17,L17,O17,R17),_xlpm.a,CHOOSE({1,2,3,4,5},H17,K17,N17,Q17,T17),SUM((_xlpm.h>_xlpm.a)*(_xlpm.h<>\"\")*(_xlpm.a<>\"\"))))","v":0},":",{"$f":"IF(COUNTA(F17:T17)=0,\"\",_xlfn.LET(_xlpm.h,CHOOSE({1,2,3,4,5},F17,I17,L17,O17,R17),_xlpm.a,CHOOSE({1,2,3,4,5},H17,K17,N17,Q17,T17),SUM((_xlpm.a>_xlpm.h)*(_xlpm.h<>\"\")*(_xlpm.a<>\"\"))))","v":0},{"$f":"IF(OR(V17=\"\",X17=\"\"),\"\",IF(MAX(V17,X17)<3,\"\",SUMPRODUCT(--($V$13:V17>$X$13:X17),--(($V$13:V17>=3)+($X$13:X17>=3)>0))))","v":""},":",{"$f":"IF(OR(V17=\"\",X17=\"\"),\"\",IF(MAX(V17,X17)<3,\"\",SUMPRODUCT(--($X$13:X17>$V$13:V17),--(($V$13:V17>=3)+($X$13:X17>=3)>0))))","v":""}]
[null,"INFANTOLINO Davide","A","Y","DRAŠĆIĆ Petar",11,":",7,11,":",6,11,":",5,null,":",null,null,":",null,null,{"$f":"IF(COUNTA(F18:T18)=0,\"\",_xlfn.LET(_xlpm.h,CHOOSE({1,2,3,4,5},F18,I18,L18,O18,R18),_xlpm.a,CHOOSE({1,2,3,4,5},H18,K18,N18,Q18,T18),SUM((_xlpm.h>_xlpm.a)*(_xlpm.h<>\"\")*(_xlpm.a<>\"\"))))","v":3},":",{"$f":"IF(COUNTA(F18:T18)=0,\"\",_xlfn.LET(_xlpm.h,CHOOSE({1,2,3,4,5},F18,I18,L18,O18,R18),_xlpm.a,CHOOSE({1,2,3,4,5},H18,K18,N18,Q18,T18),SUM((_xlpm.a>_xlpm.h)*(_xlpm.h<>\"\")*(_xlpm.a<>\"\"))))","v":0},{"$f":"IF(OR(V18=\"\",X18=\"\"),\"\",IF(MAX(V18,X18)<3,\"\",SUMPRODUCT(--($V$13:V18>$X$13:X18),--(($V$13:V18>=3)+($X$13:X18>=3)>0))))","v":4},":",{"$f":"IF(OR(V18=\"\",X18=\"\"),\"\",IF(MAX(V18,X18)<3,\"\",SUMPRODUCT(--($X$13:X18>$V$13:V18),--(($V$13:V18>=3)+($X$13:X18>=3)>0))))","v":1}]
[null,null,"C","X",null,null,":",null,null,":",null,null,":",null,null,":",null,null,":",null,null,{"$f":"IF(COUNTA(F19:T19)=0,\"\",_xlfn.LET(_xlpm.h,CHOOSE({1,2,3,4,5},F19,I19,L19,O19,R19),_xlpm.a,CHOOSE({1,2,3,4,5},H19,K19,N19,Q19,T19),SUM((_xlpm.h>_xlpm.a)*(_xlpm.h<>\"\")*(_xlpm.a<>\"\"))))","v":0},":",{"$f":"IF(COUNTA(F19:T19)=0,\"\",_xlfn.LET(_xlpm.h,CHOOSE({1,2,3,4,5},F19,I19,L19,O19,R19),_xlpm.a,CHOOSE({1,2,3,4,5},H19,K19,N19,Q19,T19),SUM((_xlpm.a>_xlpm.h)*(_xlpm.h<>\"\")*(_xlpm.a<>\"\"))))","v":0},{"$f":"IF(OR(V19=\"\",X19=\"\"),\"\",IF(MAX(V19,X19)<3,\"\",SUMPRODUCT(--($V$13:V19>$X$13:X19),--(($V$13:V19>=3)+($X$13:X19>=3)>0))))","v":""},":",{"$f":"IF(OR(V19=\"\",X19=\"\"),\"\",IF(MAX(V19,X19)<3,\"\",SUMPRODUCT(--($X$13:X19>$V$13:V19),--(($V$13:V19>=3)+($X$13:X19>=3)>0))))","v":""}]
[null,null,"B","Z",null,null,":",null,null,":",null,null,":",null,null,":",null,null,":",null,null,{"$f":"IF(COUNTA(F20:T20)=0,\"\",_xlfn.LET(_xlpm.h,CHOOSE({1,2,3,4,5},F20,I20,L20,O20,R20),_xlpm.a,CHOOSE({1,2,3,4,5},H20,K20,N20,Q20,T20),SUM((_xlpm.h>_xlpm.a)*(_xlpm.h<>\"\")*(_xlpm.a<>\"\"))))","v":0},":",{"$f":"IF(COUNTA(F20:T20)=0,\"\",_xlfn.LET(_xlpm.h,CHOOSE({1,2,3,4,5},F20,I20,L20,O20,R20),_xlpm.a,CHOOSE({1,2,3,4,5},H20,K20,N20,Q20,T20),SUM((_xlpm.a>_xlpm.h)*(_xlpm.h<>\"\")*(_xlpm.a<>\"\"))))","v":0},{"$f":"IF(OR(V20=\"\",X20=\"\"),\"\",IF(MAX(V20,X20)<3,\"\",SUMPRODUCT(--($V$13:V20>$X$13:X20),--(($V$13:V20>=3)+($X$13:X20>=3)>0))))","v":""},":",{"$f":"IF(OR(V20=\"\",X20=\"\"),\"\",IF(MAX(V20,X20)<3,\"\",SUMPRODUCT(--($X$13:X20>$V$13:V20),--(($V$13:V20>=3)+($X$13:X20>=3)>0))))","v":""}]
[]
[null,{"$f":"B4","v":"VAL SHARK"},":",null,{"$f":"E4","v":"BUZET 2"},{"$f":"MAX(Y13:Y20)","v":4},":",{"$f":"MAX(AA13:AA20)","v":1}]
[null,null,null,null,"SETOVI",{"$f":"SUM(V13:V20)","v":14},":",{"$f":"SUM(X13:X20)","v":3}]
[null,null,null,null,"POENI",{"$f":"SUM(F13:F20, I13:I20, L13:L20, O13:O20, R13:R20)","v":177},":",{"$f":"SUM(H13:H20, K13:K20, N13:N20, Q13:Q20, T13:T20)","v":117}]

{"sheet":"ZAPISNIK_4_4","index":19,"n_rows":24,"n_cols":48,"rows_kept":24,"cut":false,"hidden":true,"merged":[[2,23,2,27],[0,0,0,27],[1,1,1,3],[1,4,1,8],[1,9,1,12],[1,13,1,18],[1,19,1,22],[1,23,1,27],[2,1,2,3],[2,4,2,8],[2,9,2,12],[2,13,2,18],[2,19,2,22]]}
["ŽUPANIJSKA LIGA STSIŽ 2025./2026",null,null,null,null,null,null,null,null,null,null,null,null,null,null,null,null,null,null,null,null,null,null,null,null,null,null,null,null,null,null,null,null,null,null,null,null,null,null,null,null,null,null,null,null,null,null,"EDIT"]
[null,"GRAD DOMAĆIN",null,null,"DVORANA",null,null,null,null,"KOLO",null,null,null,"DATUM",null,null,null,null,null,"SAT"]
[null,"PULA",null,null,"MZ Gregovica, Pula",null,null,null,null,"4.",null,null,null,"4. 12. 2025.",null,null,null,null,null,"18:00:00"]
["Domaćin","VAL SHARK",null,"Gost","BUZET 1"]
["A","INFANTOLINO Davide",null,"X","PAULUS Michael"]
["B","IVINIĆ Serđo",null,"Y","BERDNYK Stanislav"]
["C","HRVANOVIĆ Jasmin",null,"Z","KRANČIĆ Filip",null,null,null,null,null," "]
["R1",null,null,"R1"]
["R2",null,null,"R2"]
[]
[null,"DOMAĆIN",null,null,"GOST"]
[null,"VAL SHARK",null,null,"BUZET 1"]
[null,"INFANTOLINO Davide","A","X","PAULUS Michael",11,":",4,11,":",1,11,":",6,null,":",null,null,":",null,null,{"$f":"IF(COUNTA(F13:T13)=0,\"\",_xlfn.LET(_xlpm.h,CHOOSE({1,2,3,4,5},F13,I13,L13,O13,R13),_xlpm.a,CHOOSE({1,2,3,4,5},H13,K13,N13,Q13,T13),SUM((_xlpm.h>_xlpm.a)*(_xlpm.h<>\"\")*(_xlpm.a<>\"\"))))","v":3},":",{"$f":"IF(COUNTA(F13:T13)=0,\"\",_xlfn.LET(_xlpm.h,CHOOSE({1,2,3,4,5},F13,I13,L13,O13,R13),_xlpm.a,CHOOSE({1,2,3,4,5},H13,K13,N13,Q13,T13),SUM((_xlpm.a>_xlpm.h)*(_xlpm.h<>\"\")*(_xlpm.a<>\"\"))))","v":0},{"$f":"IF(OR(V13=\"\",X13=\"\"),\"\",IF(MAX(V13,X13)<3,\"\",SUMPRODUCT(--($V$13:V13>$X$13:X13),--(($V$13:V13>=3)+($X$13:X13>=3)>0))))","v":1},":",{"$f":"IF(OR(V13=\"\",X13=\"\"),\"\",IF(MAX(V13,X13)<3,\"\",SUMPRODUCT(--($X$13:X13>$V$13:V13),--(($V$13:V13>=3)+($X$13:X13>=3)>0))))","v":0}]
[null,"IVINIĆ Serđo","B","Y","BERDNYK Stanislav",11,":",8,3,":",11,8,":",11,11,":",8,11,":",6,null,{"$f":"IF(COUNTA(F14:T14)=0,\"\",_xlfn.LET(_xlpm.h,CHOOSE({1,2,3,4,5},F14,I14,L14,O14,R14),_xlpm.a,CHOOSE({1,2,3,4,5},H14,K14,N14,Q14,T14),SUM((_xlpm.h>_xlpm.a)*(_xlpm.h<>\"\")*(_xlpm.a<>\"\"))))","v":3},":",{"$f":"IF(COUNTA(F14:T14)=0,\"\",_xlfn.LET(_xlpm.h,CHOOSE({1,2,3,4,5},F14,I14,L14,O14,R14),_xlpm.a,CHOOSE({1,2,3,4,5},H14,K14,N14,Q14,T14),SUM((_xlpm.a>_xlpm.h)*(_xlpm.h<>\"\")*(_xlpm.a<>\"\"))))","v":2},{"$f":"IF(OR(V14=\"\",X14=\"\"),\"\",IF(MAX(V14,X14)<3,\"\",SUMPRODUCT(--($V$13:V14>$X$13:X14),--(($V$13:V14>=3)+($X$13:X14>=3)>0))))","v":2},":",{"$f":"IF(OR(V14=\"\",X14=\"\"),\"\",IF(MAX(V14,X14)<3,\"\",SUMPRODUCT(--($X$13:X14>$V$13:V14),--(($V$13:V14>=3)+($X$13:X14>=3)>0))))","v":0}]
[null,"HRVANOVIĆ Jasmin","C","Z","KRANČIĆ Filip",12,":",10,4,":",11,11,":",9,8,":",11,11,":",3,null,{"$f":"IF(COUNTA(F15:T15)=0,\"\",_xlfn.LET(_xlpm.h,CHOOSE({1,2,3,4,5},F15,I15,L15,O15,R15),_xlpm.a,CHOOSE({1,2,3,4,5},H15,K15,N15,Q15,T15),SUM((_xlpm.h>_xlpm.a)*(_xlpm.h<>\"\")*(_xlpm.a<>\"\"))))","v":3},":",{"$f":"IF(COUNTA(F15:T15)=0,\"\",_xlfn.LET(_xlpm.h,CHOOSE({1,2,3,4,5},F15,I15,L15,O15,R15),_xlpm.a,CHOOSE({1,2,3,4,5},H15,K15,N15,Q15,T15),SUM((_xlpm.a>_xlpm.h)*(_xlpm.h<>\"\")*(_xlpm.a<>\"\"))))","v":2},{"$f":"IF(OR(V15=\"\",X15=\"\"),\"\",IF(MAX(V15,X15)<3,\"\",SUMPRODUCT(--($V$13:V15>$X$13:X15),--(($V$13:V15>=3)+($X$13:X15>=3)>0))))","v":3},":",{"$f":"IF(OR(V15=\"\",X15=\"\"),\"\",IF(MAX(V15,X15)<3,\"\",SUMPRODUCT(--($X$13:X15>$V$13:V15),--(($V$13:V15>=3)+($X$13:X15>=3)>0))))","v":0}]
[null,"HRVANOVIĆ J., IVINIĆ S.","PAR","PAR","SIROTIĆ A., BERDNYK S.",11,":",9,11,":",8,11,":",8,null,":",null,null,":",null,null,{"$f":"IF(COUNTA(F16:T16)=0,\"\",_xlfn.LET(_xlpm.h,CHOOSE({1,2,3,4,5},F16,I16,L16,O16,R16),_xlpm.a,CHOOSE({1,2,3,4,5},H16,K16,N16,Q16,T16),SUM((_xlpm.h>_xlpm.a)*(_xlpm.h<>\"\")*(_xlpm.a<>\"\"))))","v":3},":",{"$f":"IF(COUNTA(F16:T16)=0,\"\",_xlfn.LET(_xlpm.h,CHOOSE({1,2,3,4,5},F16,I16,L16,O16,R16),_xlpm.a,CHOOSE({1,2,3,4,5},H16,K16,N16,Q16,T16),SUM((_xlpm.a>_xlpm.h)*(_xlpm.h<>\"\")*(_xlpm.a<>\"\"))))","v":0},{"$f":"IF(OR(V16=\"\",X16=\"\"),\"\",IF(MAX(V16,X16)<3,\"\",SUMPRODUCT(--($V$13:V16>$X$13:X16),--(($V$13:V16>=3)+($X$13:X16>=3)>0))))","v":4},":",{"$f":"IF(OR(V16=\"\",X16=\"\"),\"\",IF(MAX(V16,X16)<3,\"\",SUMPRODUCT(--($X$13:X16>$V$13:V16),--(($V$13:V16>=3)+($X$13:X16>=3)>0))))","v":0}]
[null,null,null,null,null,null,":",null,null,":",null,null,":",null,null,":",null,null,":",null,null,{"$f":"IF(COUNTA(F17:T17)=0,\"\",_xlfn.LET(_xlpm.h,CHOOSE({1,2,3,4,5},F17,I17,L17,O17,R17),_xlpm.a,CHOOSE({1,2,3,4,5},H17,K17,N17,Q17,T17),SUM((_xlpm.h>_xlpm.a)*(_xlpm.h<>\"\")*(_xlpm.a<>\"\"))))","v":0},":",{"$f":"IF(COUNTA(F17:T17)=0,\"\",_xlfn.LET(_xlpm.h,CHOOSE({1,2,3,4,5},F17,I17,L17,O17,R17),_xlpm.a,CHOOSE({1,2,3,4,5},H17,K17,N17,Q17,T17),SUM((_xlpm.a>_xlpm.h)*(_xlpm.h<>\"\")*(_xlpm.a<>\"\"))))","v":0},{"$f":"IF(OR(V17=\"\",X17=\"\"),\"\",IF(MAX(V17,X17)<3,\"\",SUMPRODUCT(--($V$13:V17>$X$13:X17),--(($V$13:V17>=3)+($X$13:X17>=3)>0))))","v":""},":",{"$f":"IF(OR(V17=\"\",X17=\"\"),\"\",IF(MAX(V17,X17)<3,\"\",SUMPRODUCT(--($X$13:X17>$V$13:V17),--(($V$13:V17>=3)+($X$13:X17>=3)>0))))","v":""}]
[null,null,"A","Y",null,null,":",null,null,":",null,null,":",null,null,":",null,null,":",null,null,{"$f":"IF(COUNTA(F18:T18)=0,\"\",_xlfn.LET(_xlpm.h,CHOOSE({1,2,3,4,5},F18,I18,L18,O18,R18),_xlpm.a,CHOOSE({1,2,3,4,5},H18,K18,N18,Q18,T18),SUM((_xlpm.h>_xlpm.a)*(_xlpm.h<>\"\")*(_xlpm.a<>\"\"))))","v":0},":",{"$f":"IF(COUNTA(F18:T18)=0,\"\",_xlfn.LET(_xlpm.h,CHOOSE({1,2,3,4,5},F18,I18,L18,O18,R18),_xlpm.a,CHOOSE({1,2,3,4,5},H18,K18,N18,Q18,T18),SUM((_xlpm.a>_xlpm.h)*(_xlpm.h<>\"\")*(_xlpm.a<>\"\"))))","v":0},{"$f":"IF(OR(V18=\"\",X18=\"\"),\"\",IF(MAX(V18,X18)<3,\"\",SUMPRODUCT(--($V$13:V18>$X$13:X18),--(($V$13:V18>=3)+($X$13:X18>=3)>0))))","v":""},":",{"$f":"IF(OR(V18=\"\",X18=\"\"),\"\",IF(MAX(V18,X18)<3,\"\",SUMPRODUCT(--($X$13:X18>$V$13:V18),--(($V$13:V18>=3)+($X$13:X18>=3)>0))))","v":""}]
[null,null,"C","X",null,null,":",null,null,":",null,null,":",null,null,":",null,null,":",null,null,{"$f":"IF(COUNTA(F19:T19)=0,\"\",_xlfn.LET(_xlpm.h,CHOOSE({1,2,3,4,5},F19,I19,L19,O19,R19),_xlpm.a,CHOOSE({1,2,3,4,5},H19,K19,N19,Q19,T19),SUM((_xlpm.h>_xlpm.a)*(_xlpm.h<>\"\")*(_xlpm.a<>\"\"))))","v":0},":",{"$f":"IF(COUNTA(F19:T19)=0,\"\",_xlfn.LET(_xlpm.h,CHOOSE({1,2,3,4,5},F19,I19,L19,O19,R19),_xlpm.a,CHOOSE({1,2,3,4,5},H19,K19,N19,Q19,T19),SUM((_xlpm.a>_xlpm.h)*(_xlpm.h<>\"\")*(_xlpm.a<>\"\"))))","v":0},{"$f":"IF(OR(V19=\"\",X19=\"\"),\"\",IF(MAX(V19,X19)<3,\"\",SUMPRODUCT(--($V$13:V19>$X$13:X19),--(($V$13:V19>=3)+($X$13:X19>=3)>0))))","v":""},":",{"$f":"IF(OR(V19=\"\",X19=\"\"),\"\",IF(MAX(V19,X19)<3,\"\",SUMPRODUCT(--($X$13:X19>$V$13:V19),--(($V$13:V19>=3)+($X$13:X19>=3)>0))))","v":""}]
[null,null,"B","Z",null,null,":",null,null,":",null,null,":",null,null,":",null,null,":",null,null,{"$f":"IF(COUNTA(F20:T20)=0,\"\",_xlfn.LET(_xlpm.h,CHOOSE({1,2,3,4,5},F20,I20,L20,O20,R20),_xlpm.a,CHOOSE({1,2,3,4,5},H20,K20,N20,Q20,T20),SUM((_xlpm.h>_xlpm.a)*(_xlpm.h<>\"\")*(_xlpm.a<>\"\"))))","v":0},":",{"$f":"IF(COUNTA(F20:T20)=0,\"\",_xlfn.LET(_xlpm.h,CHOOSE({1,2,3,4,5},F20,I20,L20,O20,R20),_xlpm.a,CHOOSE({1,2,3,4,5},H20,K20,N20,Q20,T20),SUM((_xlpm.a>_xlpm.h)*(_xlpm.h<>\"\")*(_xlpm.a<>\"\"))))","v":0},{"$f":"IF(OR(V20=\"\",X20=\"\"),\"\",IF(MAX(V20,X20)<3,\"\",SUMPRODUCT(--($V$13:V20>$X$13:X20),--(($V$13:V20>=3)+($X$13:X20>=3)>0))))","v":""},":",{"$f":"IF(OR(V20=\"\",X20=\"\"),\"\",IF(MAX(V20,X20)<3,\"\",SUMPRODUCT(--($X$13:X20>$V$13:V20),--(($V$13:V20>=3)+($X$13:X20>=3)>0))))","v":""}]
[]
[null,{"$f":"B4","v":"VAL SHARK"},":",null,{"$f":"E4","v":"BUZET 1"},{"$f":"MAX(Y13:Y20)","v":4},":",{"$f":"MAX(AA13:AA20)","v":0}]
[null,null,null,null,"SETOVI",{"$f":"SUM(V13:V20)","v":12},":",{"$f":"SUM(X13:X20)","v":4}]
[null,null,null,null,"POENI",{"$f":"SUM(F13:F20, I13:I20, L13:L20, O13:O20, R13:R20)","v":156},":",{"$f":"SUM(H13:H20, K13:K20, N13:N20, Q13:Q20, T13:T20)","v":124}]

{"sheet":"ZAPISNIK_4_5","index":20,"n_rows":24,"n_cols":48,"rows_kept":24,"cut":false,"hidden":true,"merged":[[2,23,2,27],[0,0,0,27],[1,1,1,3],[1,4,1,8],[1,9,1,12],[1,13,1,18],[1,19,1,22],[1,23,1,27],[2,1,2,3],[2,4,2,8],[2,9,2,12],[2,13,2,18],[2,19,2,22]]}
["ŽUPANIJSKA LIGA STSIŽ 2025./2026",null,null,null,null,null,null,null,null,null,null,null,null,null,null,null,null,null,null,null,null,null,null,null,null,null,null,null,null,null,null,null,null,null,null,null,null,null,null,null,null,null,null,null,null,null,null,"EDIT"]
[null,"GRAD DOMAĆIN",null,null,"DVORANA",null,null,null,null,"KOLO",null,null,null,"DATUM",null,null,null,null,null,"SAT"]
[null,"KOROMAČNO",null,null,"Društveni dom Koromačno",null,null,null,null,"4.",null,null,null,"27. 11. 2025.",null,null,null,null,null,"17:30:00"]
["Domaćin","BROVINJE 2",null,"Gost","PAZIN"]
["A","BASIACO Leonida",null,"X","FABRIS Karlo"]
["B","BENAZIĆ Sandro",null,"Y","GLAVINIĆ Denis"]
["C","GASPARI HUDOLETNJAK Matija",null,"Z","FABIJAN Damir",null,null,null,null,null," "]
["R1",null,null,"R1"]
["R2",null,null,"R2"]
[]
[null,"DOMAĆIN",null,null,"GOST"]
[null,"BROVINJE 2",null,null,"PAZIN"]
[null,"BASIACO Leonida","A","X","FABRIS Karlo",7,":",11,5,":",11,8,":",11,null,":",null,null,":",null,null,{"$f":"IF(COUNTA(F13:T13)=0,\"\",_xlfn.LET(_xlpm.h,CHOOSE({1,2,3,4,5},F13,I13,L13,O13,R13),_xlpm.a,CHOOSE({1,2,3,4,5},H13,K13,N13,Q13,T13),SUM((_xlpm.h>_xlpm.a)*(_xlpm.h<>\"\")*(_xlpm.a<>\"\"))))","v":0},":",{"$f":"IF(COUNTA(F13:T13)=0,\"\",_xlfn.LET(_xlpm.h,CHOOSE({1,2,3,4,5},F13,I13,L13,O13,R13),_xlpm.a,CHOOSE({1,2,3,4,5},H13,K13,N13,Q13,T13),SUM((_xlpm.a>_xlpm.h)*(_xlpm.h<>\"\")*(_xlpm.a<>\"\"))))","v":3},{"$f":"IF(OR(V13=\"\",X13=\"\"),\"\",IF(MAX(V13,X13)<3,\"\",SUMPRODUCT(--($V$13:V13>$X$13:X13),--(($V$13:V13>=3)+($X$13:X13>=3)>0))))","v":0},":",{"$f":"IF(OR(V13=\"\",X13=\"\"),\"\",IF(MAX(V13,X13)<3,\"\",SUMPRODUCT(--($X$13:X13>$V$13:V13),--(($V$13:V13>=3)+($X$13:X13>=3)>0))))","v":1}]
[null,"BENAZIĆ Sandro","B","Y","GLAVINIĆ Denis",4,":",11,5,":",11,8,":",11,null,":",null,null,":",null,null,{"$f":"IF(COUNTA(F14:T14)=0,\"\",_xlfn.LET(_xlpm.h,CHOOSE({1,2,3,4,5},F14,I14,L14,O14,R14),_xlpm.a,CHOOSE({1,2,3,4,5},H14,K14,N14,Q14,T14),SUM((_xlpm.h>_xlpm.a)*(_xlpm.h<>\"\")*(_xlpm.a<>\"\"))))","v":0},":",{"$f":"IF(COUNTA(F14:T14)=0,\"\",_xlfn.LET(_xlpm.h,CHOOSE({1,2,3,4,5},F14,I14,L14,O14,R14),_xlpm.a,CHOOSE({1,2,3,4,5},H14,K14,N14,Q14,T14),SUM((_xlpm.a>_xlpm.h)*(_xlpm.h<>\"\")*(_xlpm.a<>\"\"))))","v":3},{"$f":"IF(OR(V14=\"\",X14=\"\"),\"\",IF(MAX(V14,X14)<3,\"\",SUMPRODUCT(--($V$13:V14>$X$13:X14),--(($V$13:V14>=3)+($X$13:X14>=3)>0))))","v":0},":",{"$f":"IF(OR(V14=\"\",X14=\"\"),\"\",IF(MAX(V14,X14)<3,\"\",SUMPRODUCT(--($X$13:X14>$V$13:V14),--(($V$13:V14>=3)+($X$13:X14>=3)>0))))","v":2}]
[null,"GASPARI HUDOLETNJAK Matija","C","Z","FABIJAN Damir",11,":",5,11,":",3,11,":",8,null,":",null,null,":",null,null,{"$f":"IF(COUNTA(F15:T15)=0,\"\",_xlfn.LET(_xlpm.h,CHOOSE({1,2,3,4,5},F15,I15,L15,O15,R15),_xlpm.a,CHOOSE({1,2,3,4,5},H15,K15,N15,Q15,T15),SUM((_xlpm.h>_xlpm.a)*(_xlpm.h<>\"\")*(_xlpm.a<>\"\"))))","v":3},":",{"$f":"IF(COUNTA(F15:T15)=0,\"\",_xlfn.LET(_xlpm.h,CHOOSE({1,2,3,4,5},F15,I15,L15,O15,R15),_xlpm.a,CHOOSE({1,2,3,4,5},H15,K15,N15,Q15,T15),SUM((_xlpm.a>_xlpm.h)*(_xlpm.h<>\"\")*(_xlpm.a<>\"\"))))","v":0},{"$f":"IF(OR(V15=\"\",X15=\"\"),\"\",IF(MAX(V15,X15)<3,\"\",SUMPRODUCT(--($V$13:V15>$X$13:X15),--(($V$13:V15>=3)+($X$13:X15>=3)>0))))","v":1},":",{"$f":"IF(OR(V15=\"\",X15=\"\"),\"\",IF(MAX(V15,X15)<3,\"\",SUMPRODUCT(--($X$13:X15>$V$13:V15),--(($V$13:V15>=3)+($X$13:X15>=3)>0))))","v":2}]
[null,"BASIACO L., GASPARI HUDOLETNJAK","PAR","PAR","GLAVINIĆ D., FABIJAN D.",11,":",7,11,":",5,11,":",6,null,":",null,null,":",null,null,{"$f":"IF(COUNTA(F16:T16)=0,\"\",_xlfn.LET(_xlpm.h,CHOOSE({1,2,3,4,5},F16,I16,L16,O16,R16),_xlpm.a,CHOOSE({1,2,3,4,5},H16,K16,N16,Q16,T16),SUM((_xlpm.h>_xlpm.a)*(_xlpm.h<>\"\")*(_xlpm.a<>\"\"))))","v":3},":",{"$f":"IF(COUNTA(F16:T16)=0,\"\",_xlfn.LET(_xlpm.h,CHOOSE({1,2,3,4,5},F16,I16,L16,O16,R16),_xlpm.a,CHOOSE({1,2,3,4,5},H16,K16,N16,Q16,T16),SUM((_xlpm.a>_xlpm.h)*(_xlpm.h<>\"\")*(_xlpm.a<>\"\"))))","v":0},{"$f":"IF(OR(V16=\"\",X16=\"\"),\"\",IF(MAX(V16,X16)<3,\"\",SUMPRODUCT(--($V$13:V16>$X$13:X16),--(($V$13:V16>=3)+($X$13:X16>=3)>0))))","v":2},":",{"$f":"IF(OR(V16=\"\",X16=\"\"),\"\",IF(MAX(V16,X16)<3,\"\",SUMPRODUCT(--($X$13:X16>$V$13:V16),--(($V$13:V16>=3)+($X$13:X16>=3)>0))))","v":2}]
[null,null,null,null,null,null,":",null,null,":",null,null,":",null,null,":",null,null,":",null,null,{"$f":"IF(COUNTA(F17:T17)=0,\"\",_xlfn.LET(_xlpm.h,CHOOSE({1,2,3,4,5},F17,I17,L17,O17,R17),_xlpm.a,CHOOSE({1,2,3,4,5},H17,K17,N17,Q17,T17),SUM((_xlpm.h>_xlpm.a)*(_xlpm.h<>\"\")*(_xlpm.a<>\"\"))))","v":0},":",{"$f":"IF(COUNTA(F17:T17)=0,\"\",_xlfn.LET(_xlpm.h,CHOOSE({1,2,3,4,5},F17,I17,L17,O17,R17),_xlpm.a,CHOOSE({1,2,3,4,5},H17,K17,N17,Q17,T17),SUM((_xlpm.a>_xlpm.h)*(_xlpm.h<>\"\")*(_xlpm.a<>\"\"))))","v":0},{"$f":"IF(OR(V17=\"\",X17=\"\"),\"\",IF(MAX(V17,X17)<3,\"\",SUMPRODUCT(--($V$13:V17>$X$13:X17),--(($V$13:V17>=3)+($X$13:X17>=3)>0))))","v":""},":",{"$f":"IF(OR(V17=\"\",X17=\"\"),\"\",IF(MAX(V17,X17)<3,\"\",SUMPRODUCT(--($X$13:X17>$V$13:V17),--(($V$13:V17>=3)+($X$13:X17>=3)>0))))","v":""}]
[null,"BASIACO Leonida","A","Y","GLAVINIĆ Denis",11,":",13,11,":",8,9,":",11,6,":",11,null,":",null,null,{"$f":"IF(COUNTA(F18:T18)=0,\"\",_xlfn.LET(_xlpm.h,CHOOSE({1,2,3,4,5},F18,I18,L18,O18,R18),_xlpm.a,CHOOSE({1,2,3,4,5},H18,K18,N18,Q18,T18),SUM((_xlpm.h>_xlpm.a)*(_xlpm.h<>\"\")*(_xlpm.a<>\"\"))))","v":1},":",{"$f":"IF(COUNTA(F18:T18)=0,\"\",_xlfn.LET(_xlpm.h,CHOOSE({1,2,3,4,5},F18,I18,L18,O18,R18),_xlpm.a,CHOOSE({1,2,3,4,5},H18,K18,N18,Q18,T18),SUM((_xlpm.a>_xlpm.h)*(_xlpm.h<>\"\")*(_xlpm.a<>\"\"))))","v":3},{"$f":"IF(OR(V18=\"\",X18=\"\"),\"\",IF(MAX(V18,X18)<3,\"\",SUMPRODUCT(--($V$13:V18>$X$13:X18),--(($V$13:V18>=3)+($X$13:X18>=3)>0))))","v":2},":",{"$f":"IF(OR(V18=\"\",X18=\"\"),\"\",IF(MAX(V18,X18)<3,\"\",SUMPRODUCT(--($X$13:X18>$V$13:V18),--(($V$13:V18>=3)+($X$13:X18>=3)>0))))","v":3}]
[null,"GASPARI HUDOLETNJAK Matija","C","X","FABRIS Karlo",7,":",11,6,":",11,11,":",6,11,":",2,11,":",3,null,{"$f":"IF(COUNTA(F19:T19)=0,\"\",_xlfn.LET(_xlpm.h,CHOOSE({1,2,3,4,5},F19,I19,L19,O19,R19),_xlpm.a,CHOOSE({1,2,3,4,5},H19,K19,N19,Q19,T19),SUM((_xlpm.h>_xlpm.a)*(_xlpm.h<>\"\")*(_xlpm.a<>\"\"))))","v":3},":",{"$f":"IF(COUNTA(F19:T19)=0,\"\",_xlfn.LET(_xlpm.h,CHOOSE({1,2,3,4,5},F19,I19,L19,O19,R19),_xlpm.a,CHOOSE({1,2,3,4,5},H19,K19,N19,Q19,T19),SUM((_xlpm.a>_xlpm.h)*(_xlpm.h<>\"\")*(_xlpm.a<>\"\"))))","v":2},{"$f":"IF(OR(V19=\"\",X19=\"\"),\"\",IF(MAX(V19,X19)<3,\"\",SUMPRODUCT(--($V$13:V19>$X$13:X19),--(($V$13:V19>=3)+($X$13:X19>=3)>0))))","v":3},":",{"$f":"IF(OR(V19=\"\",X19=\"\"),\"\",IF(MAX(V19,X19)<3,\"\",SUMPRODUCT(--($X$13:X19>$V$13:V19),--(($V$13:V19>=3)+($X$13:X19>=3)>0))))","v":3}]
[null,"BENAZIĆ Sandro","B","Z","FABIJAN Damir",11,":",7,11,":",5,13,":",15,5,":",11,6,":",11,null,{"$f":"IF(COUNTA(F20:T20)=0,\"\",_xlfn.LET(_xlpm.h,CHOOSE({1,2,3,4,5},F20,I20,L20,O20,R20),_xlpm.a,CHOOSE({1,2,3,4,5},H20,K20,N20,Q20,T20),SUM((_xlpm.h>_xlpm.a)*(_xlpm.h<>\"\")*(_xlpm.a<>\"\"))))","v":2},":",{"$f":"IF(COUNTA(F20:T20)=0,\"\",_xlfn.LET(_xlpm.h,CHOOSE({1,2,3,4,5},F20,I20,L20,O20,R20),_xlpm.a,CHOOSE({1,2,3,4,5},H20,K20,N20,Q20,T20),SUM((_xlpm.a>_xlpm.h)*(_xlpm.h<>\"\")*(_xlpm.a<>\"\"))))","v":3},{"$f":"IF(OR(V20=\"\",X20=\"\"),\"\",IF(MAX(V20,X20)<3,\"\",SUMPRODUCT(--($V$13:V20>$X$13:X20),--(($V$13:V20>=3)+($X$13:X20>=3)>0))))","v":3},":",{"$f":"IF(OR(V20=\"\",X20=\"\"),\"\",IF(MAX(V20,X20)<3,\"\",SUMPRODUCT(--($X$13:X20>$V$13:V20),--(($V$13:V20>=3)+($X$13:X20>=3)>0))))","v":4}]
[]
[null,{"$f":"B4","v":"BROVINJE 2"},":",null,{"$f":"E4","v":"PAZIN"},{"$f":"MAX(Y13:Y20)","v":3},":",{"$f":"MAX(AA13:AA20)","v":4}]
[null,null,null,null,"SETOVI",{"$f":"SUM(V13:V20)","v":12},":",{"$f":"SUM(X13:X20)","v":14}]
[null,null,null,null,"POENI",{"$f":"SUM(F13:F20, I13:I20, L13:L20, O13:O20, R13:R20)","v":232},":",{"$f":"SUM(H13:H20, K13:K20, N13:N20, Q13:Q20, T13:T20)","v":225}]

{"sheet":"ZAPISNIK_4_6","index":21,"n_rows":24,"n_cols":48,"rows_kept":24,"cut":false,"hidden":true,"merged":[[2,23,2,27],[0,0,0,27],[1,1,1,3],[1,4,1,8],[1,9,1,12],[1,13,1,18],[1,19,1,22],[1,23,1,27],[2,1,2,3],[2,4,2,8],[2,9,2,12],[2,13,2,18],[2,19,2,22]]}
["ŽUPANIJSKA LIGA STSIŽ 2025./2026.",null,null,null,null,null,null,null,null,null,null,null,null,null,null,null,null,null,null,null,null,null,null,null,null,null,null,null,null,null,null,null,null,null,null,null,null,null,null,null,null,null,null,null,null,null,null,"EDIT"]
[null,"GRAD DOMAĆIN",null,null,"DVORANA",null,null,null,null,"KOLO",null,null,null,"DATUM",null,null,null,null,null,"SAT"]
[null,"-",null,null,"-",null,null,null,null,"-",null,null,null,"1. 9. 2025."]
["Domaćin","BROVINJE 2",null,"Gost","MAESTRAL 2",null,null,null,null,null,null,null,null,"Gost"]
["A","GASPARI HUDOLETNJAK Matija",null,"X","KMET Teo"]
["B","BENAZIĆ Sandro",null,"Y","VIŽINTIN Marino"]
["C","BASIACO Leonida",null,"Z","SMAIĆ Bruno",null,null,null,null,null," "]
["R1",null,null,"R1"]
["R2",null,null,"R2"]
[]
[null,"DOMAĆIN",null,null,"GOST"]
[null,"BROVINJE 2",null,null,"MAESTRAL 2"]
[null,"GASPARI HUDOLETNJAK Matija","A","X","KMET Teo",11,":",5,11,":",4,11,":",4,null,":",null,null,":",null,null,{"$f":"IF(COUNTA(F13:T13)=0,\"\",_xlfn.LET(_xlpm.h,CHOOSE({1,2,3,4,5},F13,I13,L13,O13,R13),_xlpm.a,CHOOSE({1,2,3,4,5},H13,K13,N13,Q13,T13),SUM((_xlpm.h>_xlpm.a)*(_xlpm.h<>\"\")*(_xlpm.a<>\"\"))))","v":3},":",{"$f":"IF(COUNTA(F13:T13)=0,\"\",_xlfn.LET(_xlpm.h,CHOOSE({1,2,3,4,5},F13,I13,L13,O13,R13),_xlpm.a,CHOOSE({1,2,3,4,5},H13,K13,N13,Q13,T13),SUM((_xlpm.a>_xlpm.h)*(_xlpm.h<>\"\")*(_xlpm.a<>\"\"))))","v":0},{"$f":"IF(OR(V13=\"\",X13=\"\"),\"\",IF(MAX(V13,X13)<3,\"\",SUMPRODUCT(--($V$13:V13>$X$13:X13),--(($V$13:V13>=3)+($X$13:X13>=3)>0))))","v":1},":",{"$f":"IF(OR(V13=\"\",X13=\"\"),\"\",IF(MAX(V13,X13)<3,\"\",SUMPRODUCT(--($X$13:X13>$V$13:V13),--(($V$13:V13>=3)+($X$13:X13>=3)>0))))","v":0}]
[null,"BENAZIĆ Sandro","B","Y","VIŽINTIN Marino",11,":",2,11,":",7,11,":",2,null,":",null,null,":",null,null,{"$f":"IF(COUNTA(F14:T14)=0,\"\",_xlfn.LET(_xlpm.h,CHOOSE({1,2,3,4,5},F14,I14,L14,O14,R14),_xlpm.a,CHOOSE({1,2,3,4,5},H14,K14,N14,Q14,T14),SUM((_xlpm.h>_xlpm.a)*(_xlpm.h<>\"\")*(_xlpm.a<>\"\"))))","v":3},":",{"$f":"IF(COUNTA(F14:T14)=0,\"\",_xlfn.LET(_xlpm.h,CHOOSE({1,2,3,4,5},F14,I14,L14,O14,R14),_xlpm.a,CHOOSE({1,2,3,4,5},H14,K14,N14,Q14,T14),SUM((_xlpm.a>_xlpm.h)*(_xlpm.h<>\"\")*(_xlpm.a<>\"\"))))","v":0},{"$f":"IF(OR(V14=\"\",X14=\"\"),\"\",IF(MAX(V14,X14)<3,\"\",SUMPRODUCT(--($V$13:V14>$X$13:X14),--(($V$13:V14>=3)+($X$13:X14>=3)>0))))","v":2},":",{"$f":"IF(OR(V14=\"\",X14=\"\"),\"\",IF(MAX(V14,X14)<3,\"\",SUMPRODUCT(--($X$13:X14>$V$13:V14),--(($V$13:V14>=3)+($X$13:X14>=3)>0))))","v":0}]
[null,"BASIACO Leonida","C","Z","SMAIĆ Bruno",11,":",5,11,":",4,11,":",5,null,":",null,null,":",null,null,{"$f":"IF(COUNTA(F15:T15)=0,\"\",_xlfn.LET(_xlpm.h,CHOOSE({1,2,3,4,5},F15,I15,L15,O15,R15),_xlpm.a,CHOOSE({1,2,3,4,5},H15,K15,N15,Q15,T15),SUM((_xlpm.h>_xlpm.a)*(_xlpm.h<>\"\")*(_xlpm.a<>\"\"))))","v":3},":",{"$f":"IF(COUNTA(F15:T15)=0,\"\",_xlfn.LET(_xlpm.h,CHOOSE({1,2,3,4,5},F15,I15,L15,O15,R15),_xlpm.a,CHOOSE({1,2,3,4,5},H15,K15,N15,Q15,T15),SUM((_xlpm.a>_xlpm.h)*(_xlpm.h<>\"\")*(_xlpm.a<>\"\"))))","v":0},{"$f":"IF(OR(V15=\"\",X15=\"\"),\"\",IF(MAX(V15,X15)<3,\"\",SUMPRODUCT(--($V$13:V15>$X$13:X15),--(($V$13:V15>=3)+($X$13:X15>=3)>0))))","v":3},":",{"$f":"IF(OR(V15=\"\",X15=\"\"),\"\",IF(MAX(V15,X15)<3,\"\",SUMPRODUCT(--($X$13:X15>$V$13:V15),--(($V$13:V15>=3)+($X$13:X15>=3)>0))))","v":0}]
[null,"BENAZIĆ S., GASPARI HUDOLETNJAK","PAR","PAR","KMET T., VIŽINTIN M.",9,":",11,11,":",5,10,":",12,11,":",6,5,":",11,null,{"$f":"IF(COUNTA(F16:T16)=0,\"\",_xlfn.LET(_xlpm.h,CHOOSE({1,2,3,4,5},F16,I16,L16,O16,R16),_xlpm.a,CHOOSE({1,2,3,4,5},H16,K16,N16,Q16,T16),SUM((_xlpm.h>_xlpm.a)*(_xlpm.h<>\"\")*(_xlpm.a<>\"\"))))","v":2},":",{"$f":"IF(COUNTA(F16:T16)=0,\"\",_xlfn.LET(_xlpm.h,CHOOSE({1,2,3,4,5},F16,I16,L16,O16,R16),_xlpm.a,CHOOSE({1,2,3,4,5},H16,K16,N16,Q16,T16),SUM((_xlpm.a>_xlpm.h)*(_xlpm.h<>\"\")*(_xlpm.a<>\"\"))))","v":3},{"$f":"IF(OR(V16=\"\",X16=\"\"),\"\",IF(MAX(V16,X16)<3,\"\",SUMPRODUCT(--($V$13:V16>$X$13:X16),--(($V$13:V16>=3)+($X$13:X16>=3)>0))))","v":3},":",{"$f":"IF(OR(V16=\"\",X16=\"\"),\"\",IF(MAX(V16,X16)<3,\"\",SUMPRODUCT(--($X$13:X16>$V$13:V16),--(($V$13:V16>=3)+($X$13:X16>=3)>0))))","v":1}]
[null,null,null,null,null,null,":",null,null,":",null,null,":",null,null,":",null,null,":",null,null,{"$f":"IF(COUNTA(F17:T17)=0,\"\",_xlfn.LET(_xlpm.h,CHOOSE({1,2,3,4,5},F17,I17,L17,O17,R17),_xlpm.a,CHOOSE({1,2,3,4,5},H17,K17,N17,Q17,T17),SUM((_xlpm.h>_xlpm.a)*(_xlpm.h<>\"\")*(_xlpm.a<>\"\"))))","v":0},":",{"$f":"IF(COUNTA(F17:T17)=0,\"\",_xlfn.LET(_xlpm.h,CHOOSE({1,2,3,4,5},F17,I17,L17,O17,R17),_xlpm.a,CHOOSE({1,2,3,4,5},H17,K17,N17,Q17,T17),SUM((_xlpm.a>_xlpm.h)*(_xlpm.h<>\"\")*(_xlpm.a<>\"\"))))","v":0},{"$f":"IF(OR(V17=\"\",X17=\"\"),\"\",IF(MAX(V17,X17)<3,\"\",SUMPRODUCT(--($V$13:V17>$X$13:X17),--(($V$13:V17>=3)+($X$13:X17>=3)>0))))","v":""},":",{"$f":"IF(OR(V17=\"\",X17=\"\"),\"\",IF(MAX(V17,X17)<3,\"\",SUMPRODUCT(--($X$13:X17>$V$13:V17),--(($V$13:V17>=3)+($X$13:X17>=3)>0))))","v":""}]
[null,"GASPARI HUDOLETNJAK Matija","A","Y","VIŽINTIN Marino",11,":",9,8,":",11,11,":",3,13,":",11,null,":",null,null,{"$f":"IF(COUNTA(F18:T18)=0,\"\",_xlfn.LET(_xlpm.h,CHOOSE({1,2,3,4,5},F18,I18,L18,O18,R18),_xlpm.a,CHOOSE({1,2,3,4,5},H18,K18,N18,Q18,T18),SUM((_xlpm.h>_xlpm.a)*(_xlpm.h<>\"\")*(_xlpm.a<>\"\"))))","v":3},":",{"$f":"IF(COUNTA(F18:T18)=0,\"\",_xlfn.LET(_xlpm.h,CHOOSE({1,2,3,4,5},F18,I18,L18,O18,R18),_xlpm.a,CHOOSE({1,2,3,4,5},H18,K18,N18,Q18,T18),SUM((_xlpm.a>_xlpm.h)*(_xlpm.h<>\"\")*(_xlpm.a<>\"\"))))","v":1},{"$f":"IF(OR(V18=\"\",X18=\"\"),\"\",IF(MAX(V18,X18)<3,\"\",SUMPRODUCT(--($V$13:V18>$X$13:X18),--(($V$13:V18>=3)+($X$13:X18>=3)>0))))","v":4},":",{"$f":"IF(OR(V18=\"\",X18=\"\"),\"\",IF(MAX(V18,X18)<3,\"\",SUMPRODUCT(--($X$13:X18>$V$13:V18),--(($V$13:V18>=3)+($X$13:X18>=3)>0))))","v":1}]
[null,null,"C","X",null,null,":",null,null,":",null,null,":",null,null,":",null,null,":",null,null,{"$f":"IF(COUNTA(F19:T19)=0,\"\",_xlfn.LET(_xlpm.h,CHOOSE({1,2,3,4,5},F19,I19,L19,O19,R19),_xlpm.a,CHOOSE({1,2,3,4,5},H19,K19,N19,Q19,T19),SUM((_xlpm.h>_xlpm.a)*(_xlpm.h<>\"\")*(_xlpm.a<>\"\"))))","v":0},":",{"$f":"IF(COUNTA(F19:T19)=0,\"\",_xlfn.LET(_xlpm.h,CHOOSE({1,2,3,4,5},F19,I19,L19,O19,R19),_xlpm.a,CHOOSE({1,2,3,4,5},H19,K19,N19,Q19,T19),SUM((_xlpm.a>_xlpm.h)*(_xlpm.h<>\"\")*(_xlpm.a<>\"\"))))","v":0},{"$f":"IF(OR(V19=\"\",X19=\"\"),\"\",IF(MAX(V19,X19)<3,\"\",SUMPRODUCT(--($V$13:V19>$X$13:X19),--(($V$13:V19>=3)+($X$13:X19>=3)>0))))","v":""},":",{"$f":"IF(OR(V19=\"\",X19=\"\"),\"\",IF(MAX(V19,X19)<3,\"\",SUMPRODUCT(--($X$13:X19>$V$13:V19),--(($V$13:V19>=3)+($X$13:X19>=3)>0))))","v":""}]
[null,null,"B","Z",null,null,":",null,null,":",null,null,":",null,null,":",null,null,":",null,null,{"$f":"IF(COUNTA(F20:T20)=0,\"\",_xlfn.LET(_xlpm.h,CHOOSE({1,2,3,4,5},F20,I20,L20,O20,R20),_xlpm.a,CHOOSE({1,2,3,4,5},H20,K20,N20,Q20,T20),SUM((_xlpm.h>_xlpm.a)*(_xlpm.h<>\"\")*(_xlpm.a<>\"\"))))","v":0},":",{"$f":"IF(COUNTA(F20:T20)=0,\"\",_xlfn.LET(_xlpm.h,CHOOSE({1,2,3,4,5},F20,I20,L20,O20,R20),_xlpm.a,CHOOSE({1,2,3,4,5},H20,K20,N20,Q20,T20),SUM((_xlpm.a>_xlpm.h)*(_xlpm.h<>\"\")*(_xlpm.a<>\"\"))))","v":0},{"$f":"IF(OR(V20=\"\",X20=\"\"),\"\",IF(MAX(V20,X20)<3,\"\",SUMPRODUCT(--($V$13:V20>$X$13:X20),--(($V$13:V20>=3)+($X$13:X20>=3)>0))))","v":""},":",{"$f":"IF(OR(V20=\"\",X20=\"\"),\"\",IF(MAX(V20,X20)<3,\"\",SUMPRODUCT(--($X$13:X20>$V$13:V20),--(($V$13:V20>=3)+($X$13:X20>=3)>0))))","v":""}]
[]
[null,{"$f":"B4","v":"BROVINJE 2"},":",null,{"$f":"E4","v":"MAESTRAL 2"},{"$f":"MAX(Y13:Y20)","v":4},":",{"$f":"MAX(AA13:AA20)","v":1}]
[null,null,null,null,"SETOVI",{"$f":"SUM(V13:V20)","v":14},":",{"$f":"SUM(X13:X20)","v":4}]
[null,null,null,null,"POENI",{"$f":"SUM(F13:F20, I13:I20, L13:L20, O13:O20, R13:R20)","v":188},":",{"$f":"SUM(H13:H20, K13:K20, N13:N20, Q13:Q20, T13:T20)","v":117}]

{"sheet":"ZAPISNIK_5_1","index":22,"n_rows":24,"n_cols":48,"rows_kept":24,"cut":false,"hidden":true,"merged":[[2,23,2,27],[0,0,0,27],[1,1,1,3],[1,4,1,8],[1,9,1,12],[1,13,1,18],[1,19,1,22],[1,23,1,27],[2,1,2,3],[2,4,2,8],[2,9,2,12],[2,13,2,18],[2,19,2,22]]}
["ŽUPANIJSKA LIGA STSIŽ 2025./2026.",null,null,null,null,null,null,null,null,null,null,null,null,null,null,null,null,null,null,null,null,null,null,null,null,null,null,null,null,null,null,null,null,null,null,null,null,null,null,null,null,null,null,null,null,null,null,"EDIT"]
[null,"GRAD DOMAĆIN",null,null,"DVORANA",null,null,null,null,"KOLO",null,null,null,"DATUM",null,null,null,null,null,"SAT"]
[null,"BUZET",null,null,"SD Buzet",null,null,null,null,"5.",null,null,null,"7. 12. 2025.",null,null,null,null,null,"11:00:00"]
["Domaćin","BUZET 1",null,"Gost","BROVINJE 2"]
["A","SIROTIĆ Aleš",null,"X","GASPARI HUDOLETNJAK Matija"]
["B","BERDNYK Stanislav",null,"Y","BASIACO Leonida"]
["C","PAULUS Michael",null,"Z","BENAZIĆ Sandro",null,null,null,null,null," "]
["R1",null,null,"R1"]
["R2",null,null,"R2"]
[]
[null,"DOMAĆIN",null,null,"GOST"]
[null,"BUZET 1",null,null,"BROVINJE 2"]
[null,"SIROTIĆ Aleš","A","X","GASPARI HUDOLETNJAK Matija",6,":",11,8,":",11,9,":",11,null,":",null,null,":",null,null,{"$f":"IF(COUNTA(F13:T13)=0,\"\",_xlfn.LET(_xlpm.h,CHOOSE({1,2,3,4,5},F13,I13,L13,O13,R13),_xlpm.a,CHOOSE({1,2,3,4,5},H13,K13,N13,Q13,T13),SUM((_xlpm.h>_xlpm.a)*(_xlpm.h<>\"\")*(_xlpm.a<>\"\"))))","v":0},":",{"$f":"IF(COUNTA(F13:T13)=0,\"\",_xlfn.LET(_xlpm.h,CHOOSE({1,2,3,4,5},F13,I13,L13,O13,R13),_xlpm.a,CHOOSE({1,2,3,4,5},H13,K13,N13,Q13,T13),SUM((_xlpm.a>_xlpm.h)*(_xlpm.h<>\"\")*(_xlpm.a<>\"\"))))","v":3},{"$f":"IF(OR(V13=\"\",X13=\"\"),\"\",IF(MAX(V13,X13)<3,\"\",SUMPRODUCT(--($V$13:V13>$X$13:X13),--(($V$13:V13>=3)+($X$13:X13>=3)>0))))","v":0},":",{"$f":"IF(OR(V13=\"\",X13=\"\"),\"\",IF(MAX(V13,X13)<3,\"\",SUMPRODUCT(--($X$13:X13>$V$13:V13),--(($V$13:V13>=3)+($X$13:X13>=3)>0))))","v":1}]
[null,"BERDNYK Stanislav","B","Y","BASIACO Leonida",11,":",8,11,":",7,4,":",11,11,":",13,11,":",8,null,{"$f":"IF(COUNTA(F14:T14)=0,\"\",_xlfn.LET(_xlpm.h,CHOOSE({1,2,3,4,5},F14,I14,L14,O14,R14),_xlpm.a,CHOOSE({1,2,3,4,5},H14,K14,N14,Q14,T14),SUM((_xlpm.h>_xlpm.a)*(_xlpm.h<>\"\")*(_xlpm.a<>\"\"))))","v":3},":",{"$f":"IF(COUNTA(F14:T14)=0,\"\",_xlfn.LET(_xlpm.h,CHOOSE({1,2,3,4,5},F14,I14,L14,O14,R14),_xlpm.a,CHOOSE({1,2,3,4,5},H14,K14,N14,Q14,T14),SUM((_xlpm.a>_xlpm.h)*(_xlpm.h<>\"\")*(_xlpm.a<>\"\"))))","v":2},{"$f":"IF(OR(V14=\"\",X14=\"\"),\"\",IF(MAX(V14,X14)<3,\"\",SUMPRODUCT(--($V$13:V14>$X$13:X14),--(($V$13:V14>=3)+($X$13:X14>=3)>0))))","v":1},":",{"$f":"IF(OR(V14=\"\",X14=\"\"),\"\",IF(MAX(V14,X14)<3,\"\",SUMPRODUCT(--($X$13:X14>$V$13:V14),--(($V$13:V14>=3)+($X$13:X14>=3)>0))))","v":1}]
[null,"PAULUS Michael","C","Z","BENAZIĆ Sandro",11,":",6,11,":",9,11,":",13,11,":",8,null,":",null,null,{"$f":"IF(COUNTA(F15:T15)=0,\"\",_xlfn.LET(_xlpm.h,CHOOSE({1,2,3,4,5},F15,I15,L15,O15,R15),_xlpm.a,CHOOSE({1,2,3,4,5},H15,K15,N15,Q15,T15),SUM((_xlpm.h>_xlpm.a)*(_xlpm.h<>\"\")*(_xlpm.a<>\"\"))))","v":3},":",{"$f":"IF(COUNTA(F15:T15)=0,\"\",_xlfn.LET(_xlpm.h,CHOOSE({1,2,3,4,5},F15,I15,L15,O15,R15),_xlpm.a,CHOOSE({1,2,3,4,5},H15,K15,N15,Q15,T15),SUM((_xlpm.a>_xlpm.h)*(_xlpm.h<>\"\")*(_xlpm.a<>\"\"))))","v":1},{"$f":"IF(OR(V15=\"\",X15=\"\"),\"\",IF(MAX(V15,X15)<3,\"\",SUMPRODUCT(--($V$13:V15>$X$13:X15),--(($V$13:V15>=3)+($X$13:X15>=3)>0))))","v":2},":",{"$f":"IF(OR(V15=\"\",X15=\"\"),\"\",IF(MAX(V15,X15)<3,\"\",SUMPRODUCT(--($X$13:X15>$V$13:V15),--(($V$13:V15>=3)+($X$13:X15>=3)>0))))","v":1}]
[null,"BERDNYK S., PAULUS M.","PAR","PAR","BASIACO L., GASPARI HUDOLETNJAK",10,":",12,11,":",4,11,":",8,11,":",3,null,":",null,null,{"$f":"IF(COUNTA(F16:T16)=0,\"\",_xlfn.LET(_xlpm.h,CHOOSE({1,2,3,4,5},F16,I16,L16,O16,R16),_xlpm.a,CHOOSE({1,2,3,4,5},H16,K16,N16,Q16,T16),SUM((_xlpm.h>_xlpm.a)*(_xlpm.h<>\"\")*(_xlpm.a<>\"\"))))","v":3},":",{"$f":"IF(COUNTA(F16:T16)=0,\"\",_xlfn.LET(_xlpm.h,CHOOSE({1,2,3,4,5},F16,I16,L16,O16,R16),_xlpm.a,CHOOSE({1,2,3,4,5},H16,K16,N16,Q16,T16),SUM((_xlpm.a>_xlpm.h)*(_xlpm.h<>\"\")*(_xlpm.a<>\"\"))))","v":1},{"$f":"IF(OR(V16=\"\",X16=\"\"),\"\",IF(MAX(V16,X16)<3,\"\",SUMPRODUCT(--($V$13:V16>$X$13:X16),--(($V$13:V16>=3)+($X$13:X16>=3)>0))))","v":3},":",{"$f":"IF(OR(V16=\"\",X16=\"\"),\"\",IF(MAX(V16,X16)<3,\"\",SUMPRODUCT(--($X$13:X16>$V$13:V16),--(($V$13:V16>=3)+($X$13:X16>=3)>0))))","v":1}]
[null,null,null,null,null,null,":",null,null,":",null,null,":",null,null,":",null,null,":",null,null,{"$f":"IF(COUNTA(F17:T17)=0,\"\",_xlfn.LET(_xlpm.h,CHOOSE({1,2,3,4,5},F17,I17,L17,O17,R17),_xlpm.a,CHOOSE({1,2,3,4,5},H17,K17,N17,Q17,T17),SUM((_xlpm.h>_xlpm.a)*(_xlpm.h<>\"\")*(_xlpm.a<>\"\"))))","v":0},":",{"$f":"IF(COUNTA(F17:T17)=0,\"\",_xlfn.LET(_xlpm.h,CHOOSE({1,2,3,4,5},F17,I17,L17,O17,R17),_xlpm.a,CHOOSE({1,2,3,4,5},H17,K17,N17,Q17,T17),SUM((_xlpm.a>_xlpm.h)*(_xlpm.h<>\"\")*(_xlpm.a<>\"\"))))","v":0},{"$f":"IF(OR(V17=\"\",X17=\"\"),\"\",IF(MAX(V17,X17)<3,\"\",SUMPRODUCT(--($V$13:V17>$X$13:X17),--(($V$13:V17>=3)+($X$13:X17>=3)>0))))","v":""},":",{"$f":"IF(OR(V17=\"\",X17=\"\"),\"\",IF(MAX(V17,X17)<3,\"\",SUMPRODUCT(--($X$13:X17>$V$13:V17),--(($V$13:V17>=3)+($X$13:X17>=3)>0))))","v":""}]
[null,"SIROTIĆ Aleš","A","Y","BASIACO Leonida",7,":",11,11,":",9,9,":",11,7,":",11,null,":",null,null,{"$f":"IF(COUNTA(F18:T18)=0,\"\",_xlfn.LET(_xlpm.h,CHOOSE({1,2,3,4,5},F18,I18,L18,O18,R18),_xlpm.a,CHOOSE({1,2,3,4,5},H18,K18,N18,Q18,T18),SUM((_xlpm.h>_xlpm.a)*(_xlpm.h<>\"\")*(_xlpm.a<>\"\"))))","v":1},":",{"$f":"IF(COUNTA(F18:T18)=0,\"\",_xlfn.LET(_xlpm.h,CHOOSE({1,2,3,4,5},F18,I18,L18,O18,R18),_xlpm.a,CHOOSE({1,2,3,4,5},H18,K18,N18,Q18,T18),SUM((_xlpm.a>_xlpm.h)*(_xlpm.h<>\"\")*(_xlpm.a<>\"\"))))","v":3},{"$f":"IF(OR(V18=\"\",X18=\"\"),\"\",IF(MAX(V18,X18)<3,\"\",SUMPRODUCT(--($V$13:V18>$X$13:X18),--(($V$13:V18>=3)+($X$13:X18>=3)>0))))","v":3},":",{"$f":"IF(OR(V18=\"\",X18=\"\"),\"\",IF(MAX(V18,X18)<3,\"\",SUMPRODUCT(--($X$13:X18>$V$13:V18),--(($V$13:V18>=3)+($X$13:X18>=3)>0))))","v":2}]
[null,"PAULUS Michael","C","X","GASPARI HUDOLETNJAK Matija",7,":",11,11,":",2,10,":",12,7,":",11,null,":",null,null,{"$f":"IF(COUNTA(F19:T19)=0,\"\",_xlfn.LET(_xlpm.h,CHOOSE({1,2,3,4,5},F19,I19,L19,O19,R19),_xlpm.a,CHOOSE({1,2,3,4,5},H19,K19,N19,Q19,T19),SUM((_xlpm.h>_xlpm.a)*(_xlpm.h<>\"\")*(_xlpm.a<>\"\"))))","v":1},":",{"$f":"IF(COUNTA(F19:T19)=0,\"\",_xlfn.LET(_xlpm.h,CHOOSE({1,2,3,4,5},F19,I19,L19,O19,R19),_xlpm.a,CHOOSE({1,2,3,4,5},H19,K19,N19,Q19,T19),SUM((_xlpm.a>_xlpm.h)*(_xlpm.h<>\"\")*(_xlpm.a<>\"\"))))","v":3},{"$f":"IF(OR(V19=\"\",X19=\"\"),\"\",IF(MAX(V19,X19)<3,\"\",SUMPRODUCT(--($V$13:V19>$X$13:X19),--(($V$13:V19>=3)+($X$13:X19>=3)>0))))","v":3},":",{"$f":"IF(OR(V19=\"\",X19=\"\"),\"\",IF(MAX(V19,X19)<3,\"\",SUMPRODUCT(--($X$13:X19>$V$13:V19),--(($V$13:V19>=3)+($X$13:X19>=3)>0))))","v":3}]
[null,"BERDNYK Stanislav","B","Z","BENAZIĆ Sandro",8,":",11,1,":",11,4,":",11,null,":",null,null,":",null,null,{"$f":"IF(COUNTA(F20:T20)=0,\"\",_xlfn.LET(_xlpm.h,CHOOSE({1,2,3,4,5},F20,I20,L20,O20,R20),_xlpm.a,CHOOSE({1,2,3,4,5},H20,K20,N20,Q20,T20),SUM((_xlpm.h>_xlpm.a)*(_xlpm.h<>\"\")*(_xlpm.a<>\"\"))))","v":0},":",{"$f":"IF(COUNTA(F20:T20)=0,\"\",_xlfn.LET(_xlpm.h,CHOOSE({1,2,3,4,5},F20,I20,L20,O20,R20),_xlpm.a,CHOOSE({1,2,3,4,5},H20,K20,N20,Q20,T20),SUM((_xlpm.a>_xlpm.h)*(_xlpm.h<>\"\")*(_xlpm.a<>\"\"))))","v":3},{"$f":"IF(OR(V20=\"\",X20=\"\"),\"\",IF(MAX(V20,X20)<3,\"\",SUMPRODUCT(--($V$13:V20>$X$13:X20),--(($V$13:V20>=3)+($X$13:X20>=3)>0))))","v":3},":",{"$f":"IF(OR(V20=\"\",X20=\"\"),\"\",IF(MAX(V20,X20)<3,\"\",SUMPRODUCT(--($X$13:X20>$V$13:V20),--(($V$13:V20>=3)+($X$13:X20>=3)>0))))","v":4}]
[]
[null,{"$f":"B4","v":"BUZET 1"},":",null,{"$f":"E4","v":"BROVINJE 2"},{"$f":"MAX(Y13:Y20)","v":3},":",{"$f":"MAX(AA13:AA20)","v":4}]
[null,null,null,null,"SETOVI",{"$f":"SUM(V13:V20)","v":11},":",{"$f":"SUM(X13:X20)","v":16}]
[null,null,null,null,"POENI",{"$f":"SUM(F13:F20, I13:I20, L13:L20, O13:O20, R13:R20)","v":240},":",{"$f":"SUM(H13:H20, K13:K20, N13:N20, Q13:Q20, T13:T20)","v":254}]

{"sheet":"ZAPISNIK_5_2","index":23,"n_rows":24,"n_cols":48,"rows_kept":24,"cut":false,"hidden":true,"merged":[[2,23,2,27],[0,0,0,27],[1,1,1,3],[1,4,1,8],[1,9,1,12],[1,13,1,18],[1,19,1,22],[1,23,1,27],[2,1,2,3],[2,4,2,8],[2,9,2,12],[2,13,2,18],[2,19,2,22]]}
["ŽUPANIJSKA LIGA STSIŽ 2025./2026.",null,null,null,null,null,null,null,null,null,null,null,null,null,null,null,null,null,null,null,null,null,null,null,null,null,null,null,null,null,null,null,null,null,null,null,null,null,null,null,null,null,null,null,null,null,null,"EDIT"]
[null,"GRAD DOMAĆIN",null,null,"DVORANA",null,null,null,null,"KOLO",null,null,null,"DATUM",null,null,null,null,null,"SAT"]
[null,"BUZET",null,null,"SD Buzet",null,null,null,null,"5.",null,null,null,"7. 12. 2025.",null,null,null,null,null,"12:30:00"]
["Domaćin","BUZET 2",null,"Gost","BROVINJE 2"]
["A","FLEGO Valter",null,"X","BASIACO Leonida"]
["B","KOS Dino",null,"Y","GASPARI HUDOLETNJAK Matija"]
["C","PAVLETIĆ Guido",null,"Z","BENAZIĆ Sandro",null,null,null,null,null," "]
["R1",null,null,"R1"]
["R2",null,null,"R2"]
[]
[null,"DOMAĆIN",null,null,"GOST"]
[null,"BUZET 2",null,null,"BROVINJE 2"]
[null,"FLEGO Valter","A","X","BASIACO Leonida",9,":",11,3,":",11,11,":",6,5,":",11,null,":",null,null,{"$f":"IF(COUNTA(F13:T13)=0,\"\",_xlfn.LET(_xlpm.h,CHOOSE({1,2,3,4,5},F13,I13,L13,O13,R13),_xlpm.a,CHOOSE({1,2,3,4,5},H13,K13,N13,Q13,T13),SUM((_xlpm.h>_xlpm.a)*(_xlpm.h<>\"\")*(_xlpm.a<>\"\"))))","v":1},":",{"$f":"IF(COUNTA(F13:T13)=0,\"\",_xlfn.LET(_xlpm.h,CHOOSE({1,2,3,4,5},F13,I13,L13,O13,R13),_xlpm.a,CHOOSE({1,2,3,4,5},H13,K13,N13,Q13,T13),SUM((_xlpm.a>_xlpm.h)*(_xlpm.h<>\"\")*(_xlpm.a<>\"\"))))","v":3},{"$f":"IF(OR(V13=\"\",X13=\"\"),\"\",IF(MAX(V13,X13)<3,\"\",SUMPRODUCT(--($V$13:V13>$X$13:X13),--(($V$13:V13>=3)+($X$13:X13>=3)>0))))","v":0},":",{"$f":"IF(OR(V13=\"\",X13=\"\"),\"\",IF(MAX(V13,X13)<3,\"\",SUMPRODUCT(--($X$13:X13>$V$13:V13),--(($V$13:V13>=3)+($X$13:X13>=3)>0))))","v":1}]
[null,"KOS Dino","B","Y","GASPARI HUDOLETNJAK Matija",7,":",11,11,":",13,4,":",11,null,":",null,null,":",null,null,{"$f":"IF(COUNTA(F14:T14)=0,\"\",_xlfn.LET(_xlpm.h,CHOOSE({1,2,3,4,5},F14,I14,L14,O14,R14),_xlpm.a,CHOOSE({1,2,3,4,5},H14,K14,N14,Q14,T14),SUM((_xlpm.h>_xlpm.a)*(_xlpm.h<>\"\")*(_xlpm.a<>\"\"))))","v":0},":",{"$f":"IF(COUNTA(F14:T14)=0,\"\",_xlfn.LET(_xlpm.h,CHOOSE({1,2,3,4,5},F14,I14,L14,O14,R14),_xlpm.a,CHOOSE({1,2,3,4,5},H14,K14,N14,Q14,T14),SUM((_xlpm.a>_xlpm.h)*(_xlpm.h<>\"\")*(_xlpm.a<>\"\"))))","v":3},{"$f":"IF(OR(V14=\"\",X14=\"\"),\"\",IF(MAX(V14,X14)<3,\"\",SUMPRODUCT(--($V$13:V14>$X$13:X14),--(($V$13:V14>=3)+($X$13:X14>=3)>0))))","v":0},":",{"$f":"IF(OR(V14=\"\",X14=\"\"),\"\",IF(MAX(V14,X14)<3,\"\",SUMPRODUCT(--($X$13:X14>$V$13:V14),--(($V$13:V14>=3)+($X$13:X14>=3)>0))))","v":2}]
[null,"PAVLETIĆ Guido","C","Z","BENAZIĆ Sandro",11,":",9,6,":",11,9,":",11,8,":",11,null,":",null,null,{"$f":"IF(COUNTA(F15:T15)=0,\"\",_xlfn.LET(_xlpm.h,CHOOSE({1,2,3,4,5},F15,I15,L15,O15,R15),_xlpm.a,CHOOSE({1,2,3,4,5},H15,K15,N15,Q15,T15),SUM((_xlpm.h>_xlpm.a)*(_xlpm.h<>\"\")*(_xlpm.a<>\"\"))))","v":1},":",{"$f":"IF(COUNTA(F15:T15)=0,\"\",_xlfn.LET(_xlpm.h,CHOOSE({1,2,3,4,5},F15,I15,L15,O15,R15),_xlpm.a,CHOOSE({1,2,3,4,5},H15,K15,N15,Q15,T15),SUM((_xlpm.a>_xlpm.h)*(_xlpm.h<>\"\")*(_xlpm.a<>\"\"))))","v":3},{"$f":"IF(OR(V15=\"\",X15=\"\"),\"\",IF(MAX(V15,X15)<3,\"\",SUMPRODUCT(--($V$13:V15>$X$13:X15),--(($V$13:V15>=3)+($X$13:X15>=3)>0))))","v":0},":",{"$f":"IF(OR(V15=\"\",X15=\"\"),\"\",IF(MAX(V15,X15)<3,\"\",SUMPRODUCT(--($X$13:X15>$V$13:V15),--(($V$13:V15>=3)+($X$13:X15>=3)>0))))","v":3}]
[null,"FLEGO V., KOS D.","PAR","PAR","BASIACO L., GASPARI HUDOLETNJAK",15,":",13,7,":",11,5,":",11,7,":",11,null,":",null,null,{"$f":"IF(COUNTA(F16:T16)=0,\"\",_xlfn.LET(_xlpm.h,CHOOSE({1,2,3,4,5},F16,I16,L16,O16,R16),_xlpm.a,CHOOSE({1,2,3,4,5},H16,K16,N16,Q16,T16),SUM((_xlpm.h>_xlpm.a)*(_xlpm.h<>\"\")*(_xlpm.a<>\"\"))))","v":1},":",{"$f":"IF(COUNTA(F16:T16)=0,\"\",_xlfn.LET(_xlpm.h,CHOOSE({1,2,3,4,5},F16,I16,L16,O16,R16),_xlpm.a,CHOOSE({1,2,3,4,5},H16,K16,N16,Q16,T16),SUM((_xlpm.a>_xlpm.h)*(_xlpm.h<>\"\")*(_xlpm.a<>\"\"))))","v":3},{"$f":"IF(OR(V16=\"\",X16=\"\"),\"\",IF(MAX(V16,X16)<3,\"\",SUMPRODUCT(--($V$13:V16>$X$13:X16),--(($V$13:V16>=3)+($X$13:X16>=3)>0))))","v":0},":",{"$f":"IF(OR(V16=\"\",X16=\"\"),\"\",IF(MAX(V16,X16)<3,\"\",SUMPRODUCT(--($X$13:X16>$V$13:V16),--(($V$13:V16>=3)+($X$13:X16>=3)>0))))","v":4}]
[null,null,null,null,null,null,":",null,null,":",null,null,":",null,null,":",null,null,":",null,null,{"$f":"IF(COUNTA(F17:T17)=0,\"\",_xlfn.LET(_xlpm.h,CHOOSE({1,2,3,4,5},F17,I17,L17,O17,R17),_xlpm.a,CHOOSE({1,2,3,4,5},H17,K17,N17,Q17,T17),SUM((_xlpm.h>_xlpm.a)*(_xlpm.h<>\"\")*(_xlpm.a<>\"\"))))","v":0},":",{"$f":"IF(COUNTA(F17:T17)=0,\"\",_xlfn.LET(_xlpm.h,CHOOSE({1,2,3,4,5},F17,I17,L17,O17,R17),_xlpm.a,CHOOSE({1,2,3,4,5},H17,K17,N17,Q17,T17),SUM((_xlpm.a>_xlpm.h)*(_xlpm.h<>\"\")*(_xlpm.a<>\"\"))))","v":0},{"$f":"IF(OR(V17=\"\",X17=\"\"),\"\",IF(MAX(V17,X17)<3,\"\",SUMPRODUCT(--($V$13:V17>$X$13:X17),--(($V$13:V17>=3)+($X$13:X17>=3)>0))))","v":""},":",{"$f":"IF(OR(V17=\"\",X17=\"\"),\"\",IF(MAX(V17,X17)<3,\"\",SUMPRODUCT(--($X$13:X17>$V$13:V17),--(($V$13:V17>=3)+($X$13:X17>=3)>0))))","v":""}]
[null,null,"A","Y",null,null,":",null,null,":",null,null,":",null,null,":",null,null,":",null,null,{"$f":"IF(COUNTA(F18:T18)=0,\"\",_xlfn.LET(_xlpm.h,CHOOSE({1,2,3,4,5},F18,I18,L18,O18,R18),_xlpm.a,CHOOSE({1,2,3,4,5},H18,K18,N18,Q18,T18),SUM((_xlpm.h>_xlpm.a)*(_xlpm.h<>\"\")*(_xlpm.a<>\"\"))))","v":0},":",{"$f":"IF(COUNTA(F18:T18)=0,\"\",_xlfn.LET(_xlpm.h,CHOOSE({1,2,3,4,5},F18,I18,L18,O18,R18),_xlpm.a,CHOOSE({1,2,3,4,5},H18,K18,N18,Q18,T18),SUM((_xlpm.a>_xlpm.h)*(_xlpm.h<>\"\")*(_xlpm.a<>\"\"))))","v":0},{"$f":"IF(OR(V18=\"\",X18=\"\"),\"\",IF(MAX(V18,X18)<3,\"\",SUMPRODUCT(--($V$13:V18>$X$13:X18),--(($V$13:V18>=3)+($X$13:X18>=3)>0))))","v":""},":",{"$f":"IF(OR(V18=\"\",X18=\"\"),\"\",IF(MAX(V18,X18)<3,\"\",SUMPRODUCT(--($X$13:X18>$V$13:V18),--(($V$13:V18>=3)+($X$13:X18>=3)>0))))","v":""}]
[null,null,"C","X",null,null,":",null,null,":",null,null,":",null,null,":",null,null,":",null,null,{"$f":"IF(COUNTA(F19:T19)=0,\"\",_xlfn.LET(_xlpm.h,CHOOSE({1,2,3,4,5},F19,I19,L19,O19,R19),_xlpm.a,CHOOSE({1,2,3,4,5},H19,K19,N19,Q19,T19),SUM((_xlpm.h>_xlpm.a)*(_xlpm.h<>\"\")*(_xlpm.a<>\"\"))))","v":0},":",{"$f":"IF(COUNTA(F19:T19)=0,\"\",_xlfn.LET(_xlpm.h,CHOOSE({1,2,3,4,5},F19,I19,L19,O19,R19),_xlpm.a,CHOOSE({1,2,3,4,5},H19,K19,N19,Q19,T19),SUM((_xlpm.a>_xlpm.h)*(_xlpm.h<>\"\")*(_xlpm.a<>\"\"))))","v":0},{"$f":"IF(OR(V19=\"\",X19=\"\"),\"\",IF(MAX(V19,X19)<3,\"\",SUMPRODUCT(--($V$13:V19>$X$13:X19),--(($V$13:V19>=3)+($X$13:X19>=3)>0))))","v":""},":",{"$f":"IF(OR(V19=\"\",X19=\"\"),\"\",IF(MAX(V19,X19)<3,\"\",SUMPRODUCT(--($X$13:X19>$V$13:V19),--(($V$13:V19>=3)+($X$13:X19>=3)>0))))","v":""}]
[null,null,"B","Z",null,null,":",null,null,":",null,null,":",null,null,":",null,null,":",null,null,{"$f":"IF(COUNTA(F20:T20)=0,\"\",_xlfn.LET(_xlpm.h,CHOOSE({1,2,3,4,5},F20,I20,L20,O20,R20),_xlpm.a,CHOOSE({1,2,3,4,5},H20,K20,N20,Q20,T20),SUM((_xlpm.h>_xlpm.a)*(_xlpm.h<>\"\")*(_xlpm.a<>\"\"))))","v":0},":",{"$f":"IF(COUNTA(F20:T20)=0,\"\",_xlfn.LET(_xlpm.h,CHOOSE({1,2,3,4,5},F20,I20,L20,O20,R20),_xlpm.a,CHOOSE({1,2,3,4,5},H20,K20,N20,Q20,T20),SUM((_xlpm.a>_xlpm.h)*(_xlpm.h<>\"\")*(_xlpm.a<>\"\"))))","v":0},{"$f":"IF(OR(V20=\"\",X20=\"\"),\"\",IF(MAX(V20,X20)<3,\"\",SUMPRODUCT(--($V$13:V20>$X$13:X20),--(($V$13:V20>=3)+($X$13:X20>=3)>0))))","v":""},":",{"$f":"IF(OR(V20=\"\",X20=\"\"),\"\",IF(MAX(V20,X20)<3,\"\",SUMPRODUCT(--($X$13:X20>$V$13:V20),--(($V$13:V20>=3)+($X$13:X20>=3)>0))))","v":""}]
[]
[null,{"$f":"B4","v":"BUZET 2"},":",null,{"$f":"E4","v":"BROVINJE 2"},{"$f":"MAX(Y13:Y20)","v":0},":",{"$f":"MAX(AA13:AA20)","v":4}]
[null,null,null,null,"SETOVI",{"$f":"SUM(V13:V20)","v":3},":",{"$f":"SUM(X13:X20)","v":12}]
[null,null,null,null,"POENI",{"$f":"SUM(F13:F20, I13:I20, L13:L20, O13:O20, R13:R20)","v":118},":",{"$f":"SUM(H13:H20, K13:K20, N13:N20, Q13:Q20, T13:T20)","v":162}]

{"sheet":"ZAPISNIK_5_3","index":24,"n_rows":24,"n_cols":48,"rows_kept":24,"cut":false,"hidden":true,"merged":[[2,23,2,27],[0,0,0,27],[1,1,1,3],[1,4,1,8],[1,9,1,12],[1,13,1,18],[1,19,1,22],[1,23,1,27],[2,1,2,3],[2,4,2,8],[2,9,2,12],[2,13,2,18],[2,19,2,22]]}
["ŽUPANIJSKA LIGA STSIŽ 2025./2026.",null,null,null,null,null,null,null,null,null,null,null,null,null,null,null,null,null,null,null,null,null,null,null,null,null,null,null,null,null,null,null,null,null,null,null,null,null,null,null,null,null,null,null,null,null,null,"EDIT"]
[null,"GRAD DOMAĆIN",null,null,"DVORANA",null,null,null,null,"KOLO",null,null,null,"DATUM",null,null,null,null,null,"SAT"]
[null,"UMAG",null,null,"SD Juraj Radovčić Umag",null,null,null,null,"5.",null,null,null,"16. 12. 2025.",null,null,null,null,null,"18:00:00"]
["Domaćin","MAESTRAL 2",null,"Gost","VAL SHARK"]
["A","PEROŠ Ana",null,"X","IVINIĆ Serđo"]
["B","KMET Teo",null,"Y","INFANTOLINO Davide"]
["C","SINČIĆ Luana",null,"Z","HRVANOVIĆ Jasmin",null,null,null,null,null," "]
["R1",null,null,"R1"]
["R2",null,null,"R2"]
[]
[null,"DOMAĆIN",null,null,"GOST"]
[null,"MAESTRAL 2",null,null,"VAL SHARK"]
[null,"PEROŠ Ana","A","X","IVINIĆ Serđo",12,":",10,9,":",11,12,":",10,11,":",9,null,":",null,null,{"$f":"IF(COUNTA(F13:T13)=0,\"\",_xlfn.LET(_xlpm.h,CHOOSE({1,2,3,4,5},F13,I13,L13,O13,R13),_xlpm.a,CHOOSE({1,2,3,4,5},H13,K13,N13,Q13,T13),SUM((_xlpm.h>_xlpm.a)*(_xlpm.h<>\"\")*(_xlpm.a<>\"\"))))","v":3},":",{"$f":"IF(COUNTA(F13:T13)=0,\"\",_xlfn.LET(_xlpm.h,CHOOSE({1,2,3,4,5},F13,I13,L13,O13,R13),_xlpm.a,CHOOSE({1,2,3,4,5},H13,K13,N13,Q13,T13),SUM((_xlpm.a>_xlpm.h)*(_xlpm.h<>\"\")*(_xlpm.a<>\"\"))))","v":1},{"$f":"IF(OR(V13=\"\",X13=\"\"),\"\",IF(MAX(V13,X13)<3,\"\",SUMPRODUCT(--($V$13:V13>$X$13:X13),--(($V$13:V13>=3)+($X$13:X13>=3)>0))))","v":1},":",{"$f":"IF(OR(V13=\"\",X13=\"\"),\"\",IF(MAX(V13,X13)<3,\"\",SUMPRODUCT(--($X$13:X13>$V$13:V13),--(($V$13:V13>=3)+($X$13:X13>=3)>0))))","v":0}]
[null,"KMET Teo","B","Y","INFANTOLINO Davide",6,":",11,4,":",11,9,":",11,null,":",null,null,":",null,null,{"$f":"IF(COUNTA(F14:T14)=0,\"\",_xlfn.LET(_xlpm.h,CHOOSE({1,2,3,4,5},F14,I14,L14,O14,R14),_xlpm.a,CHOOSE({1,2,3,4,5},H14,K14,N14,Q14,T14),SUM((_xlpm.h>_xlpm.a)*(_xlpm.h<>\"\")*(_xlpm.a<>\"\"))))","v":0},":",{"$f":"IF(COUNTA(F14:T14)=0,\"\",_xlfn.LET(_xlpm.h,CHOOSE({1,2,3,4,5},F14,I14,L14,O14,R14),_xlpm.a,CHOOSE({1,2,3,4,5},H14,K14,N14,Q14,T14),SUM((_xlpm.a>_xlpm.h)*(_xlpm.h<>\"\")*(_xlpm.a<>\"\"))))","v":3},{"$f":"IF(OR(V14=\"\",X14=\"\"),\"\",IF(MAX(V14,X14)<3,\"\",SUMPRODUCT(--($V$13:V14>$X$13:X14),--(($V$13:V14>=3)+($X$13:X14>=3)>0))))","v":1},":",{"$f":"IF(OR(V14=\"\",X14=\"\"),\"\",IF(MAX(V14,X14)<3,\"\",SUMPRODUCT(--($X$13:X14>$V$13:V14),--(($V$13:V14>=3)+($X$13:X14>=3)>0))))","v":1}]
[null,"SINČIĆ Luana","C","Z","HRVANOVIĆ Jasmin",11,":",7,11,":",9,6,":",11,8,":",11,11,":",4,null,{"$f":"IF(COUNTA(F15:T15)=0,\"\",_xlfn.LET(_xlpm.h,CHOOSE({1,2,3,4,5},F15,I15,L15,O15,R15),_xlpm.a,CHOOSE({1,2,3,4,5},H15,K15,N15,Q15,T15),SUM((_xlpm.h>_xlpm.a)*(_xlpm.h<>\"\")*(_xlpm.a<>\"\"))))","v":3},":",{"$f":"IF(COUNTA(F15:T15)=0,\"\",_xlfn.LET(_xlpm.h,CHOOSE({1,2,3,4,5},F15,I15,L15,O15,R15),_xlpm.a,CHOOSE({1,2,3,4,5},H15,K15,N15,Q15,T15),SUM((_xlpm.a>_xlpm.h)*(_xlpm.h<>\"\")*(_xlpm.a<>\"\"))))","v":2},{"$f":"IF(OR(V15=\"\",X15=\"\"),\"\",IF(MAX(V15,X15)<3,\"\",SUMPRODUCT(--($V$13:V15>$X$13:X15),--(($V$13:V15>=3)+($X$13:X15>=3)>0))))","v":2},":",{"$f":"IF(OR(V15=\"\",X15=\"\"),\"\",IF(MAX(V15,X15)<3,\"\",SUMPRODUCT(--($X$13:X15>$V$13:V15),--(($V$13:V15>=3)+($X$13:X15>=3)>0))))","v":1}]
[null,"SINČIĆ L., PEROŠ A.","PAR","PAR","HRVANOVIĆ J., IVINIĆ S.",18,":",16,11,":",8,12,":",10,null,":",null,null,":",null,null,{"$f":"IF(COUNTA(F16:T16)=0,\"\",_xlfn.LET(_xlpm.h,CHOOSE({1,2,3,4,5},F16,I16,L16,O16,R16),_xlpm.a,CHOOSE({1,2,3,4,5},H16,K16,N16,Q16,T16),SUM((_xlpm.h>_xlpm.a)*(_xlpm.h<>\"\")*(_xlpm.a<>\"\"))))","v":3},":",{"$f":"IF(COUNTA(F16:T16)=0,\"\",_xlfn.LET(_xlpm.h,CHOOSE({1,2,3,4,5},F16,I16,L16,O16,R16),_xlpm.a,CHOOSE({1,2,3,4,5},H16,K16,N16,Q16,T16),SUM((_xlpm.a>_xlpm.h)*(_xlpm.h<>\"\")*(_xlpm.a<>\"\"))))","v":0},{"$f":"IF(OR(V16=\"\",X16=\"\"),\"\",IF(MAX(V16,X16)<3,\"\",SUMPRODUCT(--($V$13:V16>$X$13:X16),--(($V$13:V16>=3)+($X$13:X16>=3)>0))))","v":3},":",{"$f":"IF(OR(V16=\"\",X16=\"\"),\"\",IF(MAX(V16,X16)<3,\"\",SUMPRODUCT(--($X$13:X16>$V$13:V16),--(($V$13:V16>=3)+($X$13:X16>=3)>0))))","v":1}]
[null,null,null,null,null,null,":",null,null,":",null,null,":",null,null,":",null,null,":",null,null,{"$f":"IF(COUNTA(F17:T17)=0,\"\",_xlfn.LET(_xlpm.h,CHOOSE({1,2,3,4,5},F17,I17,L17,O17,R17),_xlpm.a,CHOOSE({1,2,3,4,5},H17,K17,N17,Q17,T17),SUM((_xlpm.h>_xlpm.a)*(_xlpm.h<>\"\")*(_xlpm.a<>\"\"))))","v":0},":",{"$f":"IF(COUNTA(F17:T17)=0,\"\",_xlfn.LET(_xlpm.h,CHOOSE({1,2,3,4,5},F17,I17,L17,O17,R17),_xlpm.a,CHOOSE({1,2,3,4,5},H17,K17,N17,Q17,T17),SUM((_xlpm.a>_xlpm.h)*(_xlpm.h<>\"\")*(_xlpm.a<>\"\"))))","v":0},{"$f":"IF(OR(V17=\"\",X17=\"\"),\"\",IF(MAX(V17,X17)<3,\"\",SUMPRODUCT(--($V$13:V17>$X$13:X17),--(($V$13:V17>=3)+($X$13:X17>=3)>0))))","v":""},":",{"$f":"IF(OR(V17=\"\",X17=\"\"),\"\",IF(MAX(V17,X17)<3,\"\",SUMPRODUCT(--($X$13:X17>$V$13:V17),--(($V$13:V17>=3)+($X$13:X17>=3)>0))))","v":""}]
[null,"PEROŠ Ana","A","Y","INFANTOLINO Davide",11,":",9,7,":",11,4,":",11,3,":",11,null,":",null,null,{"$f":"IF(COUNTA(F18:T18)=0,\"\",_xlfn.LET(_xlpm.h,CHOOSE({1,2,3,4,5},F18,I18,L18,O18,R18),_xlpm.a,CHOOSE({1,2,3,4,5},H18,K18,N18,Q18,T18),SUM((_xlpm.h>_xlpm.a)*(_xlpm.h<>\"\")*(_xlpm.a<>\"\"))))","v":1},":",{"$f":"IF(COUNTA(F18:T18)=0,\"\",_xlfn.LET(_xlpm.h,CHOOSE({1,2,3,4,5},F18,I18,L18,O18,R18),_xlpm.a,CHOOSE({1,2,3,4,5},H18,K18,N18,Q18,T18),SUM((_xlpm.a>_xlpm.h)*(_xlpm.h<>\"\")*(_xlpm.a<>\"\"))))","v":3},{"$f":"IF(OR(V18=\"\",X18=\"\"),\"\",IF(MAX(V18,X18)<3,\"\",SUMPRODUCT(--($V$13:V18>$X$13:X18),--(($V$13:V18>=3)+($X$13:X18>=3)>0))))","v":3},":",{"$f":"IF(OR(V18=\"\",X18=\"\"),\"\",IF(MAX(V18,X18)<3,\"\",SUMPRODUCT(--($X$13:X18>$V$13:V18),--(($V$13:V18>=3)+($X$13:X18>=3)>0))))","v":2}]
[null,"SINČIĆ Luana","C","X","IVINIĆ Serđo",10,":",12,11,":",9,9,":",11,12,":",10,11,":",6,null,{"$f":"IF(COUNTA(F19:T19)=0,\"\",_xlfn.LET(_xlpm.h,CHOOSE({1,2,3,4,5},F19,I19,L19,O19,R19),_xlpm.a,CHOOSE({1,2,3,4,5},H19,K19,N19,Q19,T19),SUM((_xlpm.h>_xlpm.a)*(_xlpm.h<>\"\")*(_xlpm.a<>\"\"))))","v":3},":",{"$f":"IF(COUNTA(F19:T19)=0,\"\",_xlfn.LET(_xlpm.h,CHOOSE({1,2,3,4,5},F19,I19,L19,O19,R19),_xlpm.a,CHOOSE({1,2,3,4,5},H19,K19,N19,Q19,T19),SUM((_xlpm.a>_xlpm.h)*(_xlpm.h<>\"\")*(_xlpm.a<>\"\"))))","v":2},{"$f":"IF(OR(V19=\"\",X19=\"\"),\"\",IF(MAX(V19,X19)<3,\"\",SUMPRODUCT(--($V$13:V19>$X$13:X19),--(($V$13:V19>=3)+($X$13:X19>=3)>0))))","v":4},":",{"$f":"IF(OR(V19=\"\",X19=\"\"),\"\",IF(MAX(V19,X19)<3,\"\",SUMPRODUCT(--($X$13:X19>$V$13:V19),--(($V$13:V19>=3)+($X$13:X19>=3)>0))))","v":2}]
[null,null,"B","Z",null,null,":",null,null,":",null,null,":",null,null,":",null,null,":",null,null,{"$f":"IF(COUNTA(F20:T20)=0,\"\",_xlfn.LET(_xlpm.h,CHOOSE({1,2,3,4,5},F20,I20,L20,O20,R20),_xlpm.a,CHOOSE({1,2,3,4,5},H20,K20,N20,Q20,T20),SUM((_xlpm.h>_xlpm.a)*(_xlpm.h<>\"\")*(_xlpm.a<>\"\"))))","v":0},":",{"$f":"IF(COUNTA(F20:T20)=0,\"\",_xlfn.LET(_xlpm.h,CHOOSE({1,2,3,4,5},F20,I20,L20,O20,R20),_xlpm.a,CHOOSE({1,2,3,4,5},H20,K20,N20,Q20,T20),SUM((_xlpm.a>_xlpm.h)*(_xlpm.h<>\"\")*(_xlpm.a<>\"\"))))","v":0},{"$f":"IF(OR(V20=\"\",X20=\"\"),\"\",IF(MAX(V20,X20)<3,\"\",SUMPRODUCT(--($V$13:V20>$X$13:X20),--(($V$13:V20>=3)+($X$13:X20>=3)>0))))","v":""},":",{"$f":"IF(OR(V20=\"\",X20=\"\"),\"\",IF(MAX(V20,X20)<3,\"\",SUMPRODUCT(--($X$13:X20>$V$13:V20),--(($V$13:V20>=3)+($X$13:X20>=3)>0))))","v":""}]
[]
[null,{"$f":"B4","v":"MAESTRAL 2"},":",null,{"$f":"E4","v":"VAL SHARK"},{"$f":"MAX(Y13:Y20)","v":4},":",{"$f":"MAX(AA13:AA20)","v":2}]
[null,null,null,null,"SETOVI",{"$f":"SUM(V13:V20)","v":13},":",{"$f":"SUM(X13:X20)","v":11}]
[null,null,null,null,"POENI",{"$f":"SUM(F13:F20, I13:I20, L13:L20, O13:O20, R13:R20)","v":229},":",{"$f":"SUM(H13:H20, K13:K20, N13:N20, Q13:Q20, T13:T20)","v":239}]

{"sheet":"ZAPISNIK_5_4","index":25,"n_rows":24,"n_cols":48,"rows_kept":24,"cut":false,"hidden":true,"merged":[[2,23,2,27],[0,0,0,27],[1,1,1,3],[1,4,1,8],[1,9,1,12],[1,13,1,18],[1,19,1,22],[1,23,1,27],[2,1,2,3],[2,4,2,8],[2,9,2,12],[2,13,2,18],[2,19,2,22]]}
["ŽUPANIJSKA LIGA STSIŽ 2025./2026.",null,null,null,null,null,null,null,null,null,null,null,null,null,null,null,null,null,null,null,null,null,null,null,null,null,null,null,null,null,null,null,null,null,null,null,null,null,null,null,null,null,null,null,null,null,null,"EDIT"]
[null,"GRAD DOMAĆIN",null,null,"DVORANA",null,null,null,null,"KOLO",null,null,null,"DATUM",null,null,null,null,null,"SAT"]
[null,"UMAG",null,null,"SD Juraj Radovčić Umag",null,null,null,null,"5.",null,null,null,"29. 12. 2025.",null,null,null,null,null,"17:00:00"]
["Domaćin","MAESTRAL 2",null,"Gost","ARENA FERRO"]
["A","PEROŠ Ana",null,"X","CINKOPAN Kristijan"]
["B","SMAIĆ Bruno",null,"Y","VINOVRŠKI Jenisej"]
["C","SINČIĆ Luana",null,"Z","KRANJC Dino",null,null,null,null,null," "]
["R1",null,null,"R1"]
["R2",null,null,"R2"]
[]
[null,"DOMAĆIN",null,null,"GOST"]
[null,"MAESTRAL 2",null,null,"ARENA FERRO"]
[null,"PEROŠ Ana","A","X","CINKOPAN Kristijan",11,":",6,6,":",11,10,":",12,12,":",10,9,":",11,null,{"$f":"IF(COUNTA(F13:T13)=0,\"\",_xlfn.LET(_xlpm.h,CHOOSE({1,2,3,4,5},F13,I13,L13,O13,R13),_xlpm.a,CHOOSE({1,2,3,4,5},H13,K13,N13,Q13,T13),SUM((_xlpm.h>_xlpm.a)*(_xlpm.h<>\"\")*(_xlpm.a<>\"\"))))","v":2},":",{"$f":"IF(COUNTA(F13:T13)=0,\"\",_xlfn.LET(_xlpm.h,CHOOSE({1,2,3,4,5},F13,I13,L13,O13,R13),_xlpm.a,CHOOSE({1,2,3,4,5},H13,K13,N13,Q13,T13),SUM((_xlpm.a>_xlpm.h)*(_xlpm.h<>\"\")*(_xlpm.a<>\"\"))))","v":3},{"$f":"IF(OR(V13=\"\",X13=\"\"),\"\",IF(MAX(V13,X13)<3,\"\",SUMPRODUCT(--($V$13:V13>$X$13:X13),--(($V$13:V13>=3)+($X$13:X13>=3)>0))))","v":0},":",{"$f":"IF(OR(V13=\"\",X13=\"\"),\"\",IF(MAX(V13,X13)<3,\"\",SUMPRODUCT(--($X$13:X13>$V$13:V13),--(($V$13:V13>=3)+($X$13:X13>=3)>0))))","v":1}]
[null,"SMAIĆ Bruno","B","Y","VINOVRŠKI Jenisej",7,":",11,5,":",11,4,":",11,null,":",null,null,":",null,null,{"$f":"IF(COUNTA(F14:T14)=0,\"\",_xlfn.LET(_xlpm.h,CHOOSE({1,2,3,4,5},F14,I14,L14,O14,R14),_xlpm.a,CHOOSE({1,2,3,4,5},H14,K14,N14,Q14,T14),SUM((_xlpm.h>_xlpm.a)*(_xlpm.h<>\"\")*(_xlpm.a<>\"\"))))","v":0},":",{"$f":"IF(COUNTA(F14:T14)=0,\"\",_xlfn.LET(_xlpm.h,CHOOSE({1,2,3,4,5},F14,I14,L14,O14,R14),_xlpm.a,CHOOSE({1,2,3,4,5},H14,K14,N14,Q14,T14),SUM((_xlpm.a>_xlpm.h)*(_xlpm.h<>\"\")*(_xlpm.a<>\"\"))))","v":3},{"$f":"IF(OR(V14=\"\",X14=\"\"),\"\",IF(MAX(V14,X14)<3,\"\",SUMPRODUCT(--($V$13:V14>$X$13:X14),--(($V$13:V14>=3)+($X$13:X14>=3)>0))))","v":0},":",{"$f":"IF(OR(V14=\"\",X14=\"\"),\"\",IF(MAX(V14,X14)<3,\"\",SUMPRODUCT(--($X$13:X14>$V$13:V14),--(($V$13:V14>=3)+($X$13:X14>=3)>0))))","v":2}]
[null,"SINČIĆ Luana","C","Z","KRANJC Dino",11,":",6,6,":",11,11,":",9,11,":",13,11,":",7,null,{"$f":"IF(COUNTA(F15:T15)=0,\"\",_xlfn.LET(_xlpm.h,CHOOSE({1,2,3,4,5},F15,I15,L15,O15,R15),_xlpm.a,CHOOSE({1,2,3,4,5},H15,K15,N15,Q15,T15),SUM((_xlpm.h>_xlpm.a)*(_xlpm.h<>\"\")*(_xlpm.a<>\"\"))))","v":3},":",{"$f":"IF(COUNTA(F15:T15)=0,\"\",_xlfn.LET(_xlpm.h,CHOOSE({1,2,3,4,5},F15,I15,L15,O15,R15),_xlpm.a,CHOOSE({1,2,3,4,5},H15,K15,N15,Q15,T15),SUM((_xlpm.a>_xlpm.h)*(_xlpm.h<>\"\")*(_xlpm.a<>\"\"))))","v":2},{"$f":"IF(OR(V15=\"\",X15=\"\"),\"\",IF(MAX(V15,X15)<3,\"\",SUMPRODUCT(--($V$13:V15>$X$13:X15),--(($V$13:V15>=3)+($X$13:X15>=3)>0))))","v":1},":",{"$f":"IF(OR(V15=\"\",X15=\"\"),\"\",IF(MAX(V15,X15)<3,\"\",SUMPRODUCT(--($X$13:X15>$V$13:V15),--(($V$13:V15>=3)+($X$13:X15>=3)>0))))","v":2}]
[null,"SINČIĆ L., PEROŠ A.","PAR","PAR","CINKOPAN K., KRANJC D.",11,":",5,7,":",11,10,":",12,11,":",3,4,":",11,null,{"$f":"IF(COUNTA(F16:T16)=0,\"\",_xlfn.LET(_xlpm.h,CHOOSE({1,2,3,4,5},F16,I16,L16,O16,R16),_xlpm.a,CHOOSE({1,2,3,4,5},H16,K16,N16,Q16,T16),SUM((_xlpm.h>_xlpm.a)*(_xlpm.h<>\"\")*(_xlpm.a<>\"\"))))","v":2},":",{"$f":"IF(COUNTA(F16:T16)=0,\"\",_xlfn.LET(_xlpm.h,CHOOSE({1,2,3,4,5},F16,I16,L16,O16,R16),_xlpm.a,CHOOSE({1,2,3,4,5},H16,K16,N16,Q16,T16),SUM((_xlpm.a>_xlpm.h)*(_xlpm.h<>\"\")*(_xlpm.a<>\"\"))))","v":3},{"$f":"IF(OR(V16=\"\",X16=\"\"),\"\",IF(MAX(V16,X16)<3,\"\",SUMPRODUCT(--($V$13:V16>$X$13:X16),--(($V$13:V16>=3)+($X$13:X16>=3)>0))))","v":1},":",{"$f":"IF(OR(V16=\"\",X16=\"\"),\"\",IF(MAX(V16,X16)<3,\"\",SUMPRODUCT(--($X$13:X16>$V$13:V16),--(($V$13:V16>=3)+($X$13:X16>=3)>0))))","v":3}]
[null,null,null,null,null,null,":",null,null,":",null,null,":",null,null,":",null,null,":",null,null,{"$f":"IF(COUNTA(F17:T17)=0,\"\",_xlfn.LET(_xlpm.h,CHOOSE({1,2,3,4,5},F17,I17,L17,O17,R17),_xlpm.a,CHOOSE({1,2,3,4,5},H17,K17,N17,Q17,T17),SUM((_xlpm.h>_xlpm.a)*(_xlpm.h<>\"\")*(_xlpm.a<>\"\"))))","v":0},":",{"$f":"IF(COUNTA(F17:T17)=0,\"\",_xlfn.LET(_xlpm.h,CHOOSE({1,2,3,4,5},F17,I17,L17,O17,R17),_xlpm.a,CHOOSE({1,2,3,4,5},H17,K17,N17,Q17,T17),SUM((_xlpm.a>_xlpm.h)*(_xlpm.h<>\"\")*(_xlpm.a<>\"\"))))","v":0},{"$f":"IF(OR(V17=\"\",X17=\"\"),\"\",IF(MAX(V17,X17)<3,\"\",SUMPRODUCT(--($V$13:V17>$X$13:X17),--(($V$13:V17>=3)+($X$13:X17>=3)>0))))","v":""},":",{"$f":"IF(OR(V17=\"\",X17=\"\"),\"\",IF(MAX(V17,X17)<3,\"\",SUMPRODUCT(--($X$13:X17>$V$13:V17),--(($V$13:V17>=3)+($X$13:X17>=3)>0))))","v":""}]
[null,"PEROŠ Ana","A","Y","VINOVRŠKI Jenisej",10,":",12,11,":",4,11,":",5,7,":",11,11,":",5,null,{"$f":"IF(COUNTA(F18:T18)=0,\"\",_xlfn.LET(_xlpm.h,CHOOSE({1,2,3,4,5},F18,I18,L18,O18,R18),_xlpm.a,CHOOSE({1,2,3,4,5},H18,K18,N18,Q18,T18),SUM((_xlpm.h>_xlpm.a)*(_xlpm.h<>\"\")*(_xlpm.a<>\"\"))))","v":3},":",{"$f":"IF(COUNTA(F18:T18)=0,\"\",_xlfn.LET(_xlpm.h,CHOOSE({1,2,3,4,5},F18,I18,L18,O18,R18),_xlpm.a,CHOOSE({1,2,3,4,5},H18,K18,N18,Q18,T18),SUM((_xlpm.a>_xlpm.h)*(_xlpm.h<>\"\")*(_xlpm.a<>\"\"))))","v":2},{"$f":"IF(OR(V18=\"\",X18=\"\"),\"\",IF(MAX(V18,X18)<3,\"\",SUMPRODUCT(--($V$13:V18>$X$13:X18),--(($V$13:V18>=3)+($X$13:X18>=3)>0))))","v":2},":",{"$f":"IF(OR(V18=\"\",X18=\"\"),\"\",IF(MAX(V18,X18)<3,\"\",SUMPRODUCT(--($X$13:X18>$V$13:V18),--(($V$13:V18>=3)+($X$13:X18>=3)>0))))","v":3}]
[null,"SINČIĆ Luana","C","X","CINKOPAN Kristijan",11,":",6,6,":",11,8,":",11,11,":",9,10,":",12,null,{"$f":"IF(COUNTA(F19:T19)=0,\"\",_xlfn.LET(_xlpm.h,CHOOSE({1,2,3,4,5},F19,I19,L19,O19,R19),_xlpm.a,CHOOSE({1,2,3,4,5},H19,K19,N19,Q19,T19),SUM((_xlpm.h>_xlpm.a)*(_xlpm.h<>\"\")*(_xlpm.a<>\"\"))))","v":2},":",{"$f":"IF(COUNTA(F19:T19)=0,\"\",_xlfn.LET(_xlpm.h,CHOOSE({1,2,3,4,5},F19,I19,L19,O19,R19),_xlpm.a,CHOOSE({1,2,3,4,5},H19,K19,N19,Q19,T19),SUM((_xlpm.a>_xlpm.h)*(_xlpm.h<>\"\")*(_xlpm.a<>\"\"))))","v":3},{"$f":"IF(OR(V19=\"\",X19=\"\"),\"\",IF(MAX(V19,X19)<3,\"\",SUMPRODUCT(--($V$13:V19>$X$13:X19),--(($V$13:V19>=3)+($X$13:X19>=3)>0))))","v":2},":",{"$f":"IF(OR(V19=\"\",X19=\"\"),\"\",IF(MAX(V19,X19)<3,\"\",SUMPRODUCT(--($X$13:X19>$V$13:V19),--(($V$13:V19>=3)+($X$13:X19>=3)>0))))","v":4}]
[null,null,"B","Z",null,null,":",null,null,":",null,null,":",null,null,":",null,null,":",null,null,{"$f":"IF(COUNTA(F20:T20)=0,\"\",_xlfn.LET(_xlpm.h,CHOOSE({1,2,3,4,5},F20,I20,L20,O20,R20),_xlpm.a,CHOOSE({1,2,3,4,5},H20,K20,N20,Q20,T20),SUM((_xlpm.h>_xlpm.a)*(_xlpm.h<>\"\")*(_xlpm.a<>\"\"))))","v":0},":",{"$f":"IF(COUNTA(F20:T20)=0,\"\",_xlfn.LET(_xlpm.h,CHOOSE({1,2,3,4,5},F20,I20,L20,O20,R20),_xlpm.a,CHOOSE({1,2,3,4,5},H20,K20,N20,Q20,T20),SUM((_xlpm.a>_xlpm.h)*(_xlpm.h<>\"\")*(_xlpm.a<>\"\"))))","v":0},{"$f":"IF(OR(V20=\"\",X20=\"\"),\"\",IF(MAX(V20,X20)<3,\"\",SUMPRODUCT(--($V$13:V20>$X$13:X20),--(($V$13:V20>=3)+($X$13:X20>=3)>0))))","v":""},":",{"$f":"IF(OR(V20=\"\",X20=\"\"),\"\",IF(MAX(V20,X20)<3,\"\",SUMPRODUCT(--($X$13:X20>$V$13:V20),--(($V$13:V20>=3)+($X$13:X20>=3)>0))))","v":""}]
[]
[null,{"$f":"B4","v":"MAESTRAL 2"},":",null,{"$f":"E4","v":"ARENA FERRO"},{"$f":"MAX(Y13:Y20)","v":2},":",{"$f":"MAX(AA13:AA20)","v":4}]
[null,null,null,null,"SETOVI",{"$f":"SUM(V13:V20)","v":12},":",{"$f":"SUM(X13:X20)","v":16}]
[null,null,null,null,"POENI",{"$f":"SUM(F13:F20, I13:I20, L13:L20, O13:O20, R13:R20)","v":253},":",{"$f":"SUM(H13:H20, K13:K20, N13:N20, Q13:Q20, T13:T20)","v":257}]

{"sheet":"ZAPISNIK MEČA_PRINT","index":26,"n_rows":24,"n_cols":25,"rows_kept":24,"cut":false,"hidden":true,"merged":[[2,23,2,27],[0,0,0,27],[1,1,1,3],[1,4,1,8],[1,9,1,12],[1,13,1,18],[1,19,1,22],[1,23,1,27],[2,1,2,3],[2,4,2,8],[2,9,2,12],[2,13,2,18],[2,19,2,22],[11,24,11,26],[11,5,11,7],[11,8,11,10],[11,11,11,13],[11,14,11,16],[11,17,11,19],[11,21,11,23]]}
["ŽUPANIJSKA LIGA STSIŽ 2025./2026"]
[null,"GRAD DOMAĆIN",null,null,"DVORANA",null,null,null,null,null,null,null,null,"DATUM",null,null,null,null,null,"SAT"]
[]
["Domaćin",null,null,"Gost"]
["A",null,null,"X"]
["B",null,null,"Y"]
["C",null,null,"Z"]
["R1",null,null,"R1"]
["R2",null,null,"R2"]
[]
[null,"DOMAĆIN",null,null,"GOST"]
[null,null,null,null,null,"1. SET",null,null,"2. SET",null,null,"3. SET",null,null,"4. SET",null,null,"5. SET",null,null,null,"REZULTAT",null,null,"UKUPNO"]
[null,null,"A","X"]
[null,null,"B","Y"]
[null,null,"C","Z"]
[null,null,"PAR","PAR"]
[]
[null,null,"A","Y"]
[null,null,"Z","X"]
[null,null,"B","Z"]
[]
[null,"POBJEDNIK",null,null,null,null,null,null,null,null,"POTPIS KAPETANA DOMAĆINA",null,null,null,null,null,null,null,null,"POTPIS KAPETANA GOSTIJU","POTPIS KAPETANA GOSTIJU"]
[null,"REZULTAT"]
[null,"SUDAC"]

{"sheet":"KOLA","index":27,"n_rows":37,"n_cols":11,"rows_kept":37,"cut":false,"hidden":true,"merged":[]}
["Popis zapisnika (unesi imena listova sa zapisnicima, npr. ZAPISNIK MEČA, ZAPISNIK 2, ...)"]
["ZAPISNIK_1_1",{"$f":"IFERROR(INDIRECT(\"'\"&$A2&\"'!B12\"),\"\")","v":"PAZIN"},{"$f":"IFERROR(INDIRECT(\"'\"&$A2&\"'!E12\"),\"\")","v":"MAESTRAL 2"},{"$f":"IFERROR(VALUE(INDIRECT(\"'\"&$A2&\"'!F22\")),0)","v":4},{"$f":"IFERROR(VALUE(INDIRECT(\"'\"&$A2&\"'!H22\")),0)","v":0},{"$f":"IFERROR(VALUE(INDIRECT(\"'\"&$A2&\"'!F23\")),0)","v":12},{"$f":"IFERROR(VALUE(INDIRECT(\"'\"&$A2&\"'!H23\")),0)","v":2},{"$f":"IFERROR(VALUE(INDIRECT(\"'\"&$A2&\"'!F24\")),0)","v":148},{"$f":"IFERROR(VALUE(INDIRECT(\"'\"&$A2&\"'!H24\")),0)","v":92},{"$f":"IFERROR(INDIRECT(\"'\"&$A2&\"'!AE22\"),\"\")","v":0},{"$f":"IFERROR(INDIRECT(\"'\"&$A2&\"'!AF22\"),\"\")","v":0}]
["ZAPISNIK_1_2",{"$f":"IFERROR(INDIRECT(\"'\"&$A3&\"'!B12\"),\"\")","v":"BUZET 1"},{"$f":"IFERROR(INDIRECT(\"'\"&$A3&\"'!E12\"),\"\")","v":"BUZET 2"},{"$f":"IFERROR(VALUE(INDIRECT(\"'\"&$A3&\"'!F22\")),0)","v":4},{"$f":"IFERROR(VALUE(INDIRECT(\"'\"&$A3&\"'!H22\")),0)","v":1},{"$f":"IFERROR(VALUE(INDIRECT(\"'\"&$A3&\"'!F23\")),0)","v":12},{"$f":"IFERROR(VALUE(INDIRECT(\"'\"&$A3&\"'!H23\")),0)","v":4},{"$f":"IFERROR(VALUE(INDIRECT(\"'\"&$A3&\"'!F24\")),0)","v":168},{"$f":"IFERROR(VALUE(INDIRECT(\"'\"&$A3&\"'!H24\")),0)","v":128},{"$f":"IFERROR(INDIRECT(\"'\"&$A3&\"'!AE22\"),\"\")","v":0},{"$f":"IFERROR(INDIRECT(\"'\"&$A3&\"'!AF22\"),\"\")","v":0}]
["ZAPISNIK_1_3",{"$f":"IFERROR(INDIRECT(\"'\"&$A4&\"'!B12\"),\"\")","v":"ARENA FERRO"},{"$f":"IFERROR(INDIRECT(\"'\"&$A4&\"'!E12\"),\"\")","v":"VAL SHARK"},{"$f":"IFERROR(VALUE(INDIRECT(\"'\"&$A4&\"'!F22\")),0)","v":4},{"$f":"IFERROR(VALUE(INDIRECT(\"'\"&$A4&\"'!H22\")),0)","v":0},{"$f":"IFERROR(VALUE(INDIRECT(\"'\"&$A4&\"'!F23\")),0)","v":12},{"$f":"IFERROR(VALUE(INDIRECT(\"'\"&$A4&\"'!H23\")),0)","v":4},{"$f":"IFERROR(VALUE(INDIRECT(\"'\"&$A4&\"'!F24\")),0)","v":162},{"$f":"IFERROR(VALUE(INDIRECT(\"'\"&$A4&\"'!H24\")),0)","v":136},{"$f":"IFERROR(INDIRECT(\"'\"&$A4&\"'!AE22\"),\"\")","v":0},{"$f":"IFERROR(INDIRECT(\"'\"&$A4&\"'!AF22\"),\"\")","v":0}]
["ZAPISNIK_2_1",{"$f":"IFERROR(INDIRECT(\"'\"&$A5&\"'!B12\"),\"\")","v":"BROVINJE 2"},{"$f":"IFERROR(INDIRECT(\"'\"&$A5&\"'!E12\"),\"\")","v":"VAL SHARK"},{"$f":"IFERROR(VALUE(INDIRECT(\"'\"&$A5&\"'!F22\")),0)","v":1},{"$f":"IFERROR(VALUE(INDIRECT(\"'\"&$A5&\"'!H22\")),0)","v":4},{"$f":"IFERROR(VALUE(INDIRECT(\"'\"&$A5&\"'!F23\")),0)","v":7},{"$f":"IFERROR(VALUE(INDIRECT(\"'\"&$A5&\"'!H23\")),0)","v":12},{"$f":"IFERROR(VALUE(INDIRECT(\"'\"&$A5&\"'!F24\")),0)","v":169},{"$f":"IFERROR(VALUE(INDIRECT(\"'\"&$A5&\"'!H24\")),0)","v":187},{"$f":"IFERROR(INDIRECT(\"'\"&$A5&\"'!AE22\"),\"\")","v":0},{"$f":"IFERROR(INDIRECT(\"'\"&$A5&\"'!AF22\"),\"\")","v":0}]
["ZAPISNIK_2_2",{"$f":"IFERROR(INDIRECT(\"'\"&$A6&\"'!B12\"),\"\")","v":"BROVINJE 2"},{"$f":"IFERROR(INDIRECT(\"'\"&$A6&\"'!E12\"),\"\")","v":"ARENA FERRO"},{"$f":"IFERROR(VALUE(INDIRECT(\"'\"&$A6&\"'!F22\")),0)","v":4},{"$f":"IFERROR(VALUE(INDIRECT(\"'\"&$A6&\"'!H22\")),0)","v":2},{"$f":"IFERROR(VALUE(INDIRECT(\"'\"&$A6&\"'!F23\")),0)","v":13},{"$f":"IFERROR(VALUE(INDIRECT(\"'\"&$A6&\"'!H23\")),0)","v":11},{"$f":"IFERROR(VALUE(INDIRECT(\"'\"&$A6&\"'!F24\")),0)","v":232},{"$f":"IFERROR(VALUE(INDIRECT(\"'\"&$A6&\"'!H24\")),0)","v":217},{"$f":"IFERROR(INDIRECT(\"'\"&$A6&\"'!AE22\"),\"\")","v":0},{"$f":"IFERROR(INDIRECT(\"'\"&$A6&\"'!AF22\"),\"\")","v":0}]
["ZAPISNIK_2_3",{"$f":"IFERROR(INDIRECT(\"'\"&$A7&\"'!B12\"),\"\")","v":"PAZIN"},{"$f":"IFERROR(INDIRECT(\"'\"&$A7&\"'!E12\"),\"\")","v":"BUZET 2"},{"$f":"IFERROR(VALUE(INDIRECT(\"'\"&$A7&\"'!F22\")),0)","v":4},{"$f":"IFERROR(VALUE(INDIRECT(\"'\"&$A7&\"'!H22\")),0)","v":1},{"$f":"IFERROR(VALUE(INDIRECT(\"'\"&$A7&\"'!F23\")),0)","v":12},{"$f":"IFERROR(VALUE(INDIRECT(\"'\"&$A7&\"'!H23\")),0)","v":5},{"$f":"IFERROR(VALUE(INDIRECT(\"'\"&$A7&\"'!F24\")),0)","v":162},{"$f":"IFERROR(VALUE(INDIRECT(\"'\"&$A7&\"'!H24\")),0)","v":123},{"$f":"IFERROR(INDIRECT(\"'\"&$A7&\"'!AE22\"),\"\")","v":0},{"$f":"IFERROR(INDIRECT(\"'\"&$A7&\"'!AF22\"),\"\")","v":0}]
["ZAPISNIK_2_4",{"$f":"IFERROR(INDIRECT(\"'\"&$A8&\"'!B12\"),\"\")","v":"PAZIN"},{"$f":"IFERROR(INDIRECT(\"'\"&$A8&\"'!E12\"),\"\")","v":"BUZET 1"},{"$f":"IFERROR(VALUE(INDIRECT(\"'\"&$A8&\"'!F22\")),0)","v":4},{"$f":"IFERROR(VALUE(INDIRECT(\"'\"&$A8&\"'!H22\")),0)","v":1},{"$f":"IFERROR(VALUE(INDIRECT(\"'\"&$A8&\"'!F23\")),0)","v":13},{"$f":"IFERROR(VALUE(INDIRECT(\"'\"&$A8&\"'!H23\")),0)","v":6},{"$f":"IFERROR(VALUE(INDIRECT(\"'\"&$A8&\"'!F24\")),0)","v":177},{"$f":"IFERROR(VALUE(INDIRECT(\"'\"&$A8&\"'!H24\")),0)","v":143},{"$f":"IFERROR(INDIRECT(\"'\"&$A8&\"'!AE22\"),\"\")","v":0},{"$f":"IFERROR(INDIRECT(\"'\"&$A8&\"'!AF22\"),\"\")","v":0}]
["ZAPISNIK_3_1",{"$f":"IFERROR(INDIRECT(\"'\"&$A9&\"'!B12\"),\"\")","v":"VAL SHARK"},{"$f":"IFERROR(INDIRECT(\"'\"&$A9&\"'!E12\"),\"\")","v":"PAZIN"},{"$f":"IFERROR(VALUE(INDIRECT(\"'\"&$A9&\"'!F22\")),0)","v":4},{"$f":"IFERROR(VALUE(INDIRECT(\"'\"&$A9&\"'!H22\")),0)","v":1},{"$f":"IFERROR(VALUE(INDIRECT(\"'\"&$A9&\"'!F23\")),0)","v":14},{"$f":"IFERROR(VALUE(INDIRECT(\"'\"&$A9&\"'!H23\")),0)","v":7},{"$f":"IFERROR(VALUE(INDIRECT(\"'\"&$A9&\"'!F24\")),0)","v":206},{"$f":"IFERROR(VALUE(INDIRECT(\"'\"&$A9&\"'!H24\")),0)","v":170},{"$f":"IFERROR(INDIRECT(\"'\"&$A9&\"'!AE22\"),\"\")","v":0},{"$f":"IFERROR(INDIRECT(\"'\"&$A9&\"'!AF22\"),\"\")","v":0}]
["ZAPISNIK_3_2",{"$f":"IFERROR(INDIRECT(\"'\"&$A10&\"'!B12\"),\"\")","v":"ARENA FERRO"},{"$f":"IFERROR(INDIRECT(\"'\"&$A10&\"'!E12\"),\"\")","v":"PAZIN"},{"$f":"IFERROR(VALUE(INDIRECT(\"'\"&$A10&\"'!F22\")),0)","v":3},{"$f":"IFERROR(VALUE(INDIRECT(\"'\"&$A10&\"'!H22\")),0)","v":4},{"$f":"IFERROR(VALUE(INDIRECT(\"'\"&$A10&\"'!F23\")),0)","v":14},{"$f":"IFERROR(VALUE(INDIRECT(\"'\"&$A10&\"'!H23\")),0)","v":13},{"$f":"IFERROR(VALUE(INDIRECT(\"'\"&$A10&\"'!F24\")),0)","v":241},{"$f":"IFERROR(VALUE(INDIRECT(\"'\"&$A10&\"'!H24\")),0)","v":225},{"$f":"IFERROR(INDIRECT(\"'\"&$A10&\"'!AE22\"),\"\")","v":0},{"$f":"IFERROR(INDIRECT(\"'\"&$A10&\"'!AF22\"),\"\")","v":0}]
["ZAPISNIK_3_3",{"$f":"IFERROR(INDIRECT(\"'\"&$A11&\"'!B12\"),\"\")","v":"BUZET 2"},{"$f":"IFERROR(INDIRECT(\"'\"&$A11&\"'!E12\"),\"\")","v":"MAESTRAL 2"},{"$f":"IFERROR(VALUE(INDIRECT(\"'\"&$A11&\"'!F22\")),0)","v":4},{"$f":"IFERROR(VALUE(INDIRECT(\"'\"&$A11&\"'!H22\")),0)","v":0},{"$f":"IFERROR(VALUE(INDIRECT(\"'\"&$A11&\"'!F23\")),0)","v":12},{"$f":"IFERROR(VALUE(INDIRECT(\"'\"&$A11&\"'!H23\")),0)","v":4},{"$f":"IFERROR(VALUE(INDIRECT(\"'\"&$A11&\"'!F24\")),0)","v":168},{"$f":"IFERROR(VALUE(INDIRECT(\"'\"&$A11&\"'!H24\")),0)","v":141},{"$f":"IFERROR(INDIRECT(\"'\"&$A11&\"'!AE22\"),\"\")","v":0},{"$f":"IFERROR(INDIRECT(\"'\"&$A11&\"'!AF22\"),\"\")","v":0}]
["ZAPISNIK_3_4",{"$f":"IFERROR(INDIRECT(\"'\"&$A12&\"'!B12\"),\"\")","v":"BUZET 1"},{"$f":"IFERROR(INDIRECT(\"'\"&$A12&\"'!E12\"),\"\")","v":"MAESTRAL 2"},{"$f":"IFERROR(VALUE(INDIRECT(\"'\"&$A12&\"'!F22\")),0)","v":4},{"$f":"IFERROR(VALUE(INDIRECT(\"'\"&$A12&\"'!H22\")),0)","v":0},{"$f":"IFERROR(VALUE(INDIRECT(\"'\"&$A12&\"'!F23\")),0)","v":12},{"$f":"IFERROR(VALUE(INDIRECT(\"'\"&$A12&\"'!H23\")),0)","v":0},{"$f":"IFERROR(VALUE(INDIRECT(\"'\"&$A12&\"'!F24\")),0)","v":133},{"$f":"IFERROR(VALUE(INDIRECT(\"'\"&$A12&\"'!H24\")),0)","v":66},{"$f":"IFERROR(INDIRECT(\"'\"&$A12&\"'!AE22\"),\"\")","v":0},{"$f":"IFERROR(INDIRECT(\"'\"&$A12&\"'!AF22\"),\"\")","v":0}]
["ZAPISNIK_4_1",{"$f":"IFERROR(INDIRECT(\"'\"&$A13&\"'!B12\"),\"\")","v":"ARENA FERRO"},{"$f":"IFERROR(INDIRECT(\"'\"&$A13&\"'!E12\"),\"\")","v":"BUZET 1"},{"$f":"IFERROR(VALUE(INDIRECT(\"'\"&$A13&\"'!F22\")),0)","v":4},{"$f":"IFERROR(VALUE(INDIRECT(\"'\"&$A13&\"'!H22\")),0)","v":1},{"$f":"IFERROR(VALUE(INDIRECT(\"'\"&$A13&\"'!F23\")),0)","v":14},{"$f":"IFERROR(VALUE(INDIRECT(\"'\"&$A13&\"'!H23\")),0)","v":4},{"$f":"IFERROR(VALUE(INDIRECT(\"'\"&$A13&\"'!F24\")),0)","v":198},{"$f":"IFERROR(VALUE(INDIRECT(\"'\"&$A13&\"'!H24\")),0)","v":151},{"$f":"IFERROR(INDIRECT(\"'\"&$A13&\"'!AE22\"),\"\")","v":0},{"$f":"IFERROR(INDIRECT(\"'\"&$A13&\"'!AF22\"),\"\")","v":0}]
["ZAPISNIK_4_2",{"$f":"IFERROR(INDIRECT(\"'\"&$A14&\"'!B12\"),\"\")","v":"ARENA FERRO"},{"$f":"IFERROR(INDIRECT(\"'\"&$A14&\"'!E12\"),\"\")","v":"BUZET 2"},{"$f":"IFERROR(VALUE(INDIRECT(\"'\"&$A14&\"'!F22\")),0)","v":4},{"$f":"IFERROR(VALUE(INDIRECT(\"'\"&$A14&\"'!H22\")),0)","v":0},{"$f":"IFERROR(VALUE(INDIRECT(\"'\"&$A14&\"'!F23\")),0)","v":12},{"$f":"IFERROR(VALUE(INDIRECT(\"'\"&$A14&\"'!H23\")),0)","v":2},{"$f":"IFERROR(VALUE(INDIRECT(\"'\"&$A14&\"'!F24\")),0)","v":148},{"$f":"IFERROR(VALUE(INDIRECT(\"'\"&$A14&\"'!H24\")),0)","v":106},{"$f":"IFERROR(INDIRECT(\"'\"&$A14&\"'!AE22\"),\"\")","v":0},{"$f":"IFERROR(INDIRECT(\"'\"&$A14&\"'!AF22\"),\"\")","v":0}]
["ZAPISNIK_4_3",{"$f":"IFERROR(INDIRECT(\"'\"&$A15&\"'!B12\"),\"\")","v":"VAL SHARK"},{"$f":"IFERROR(INDIRECT(\"'\"&$A15&\"'!E12\"),\"\")","v":"BUZET 2"},{"$f":"IFERROR(VALUE(INDIRECT(\"'\"&$A15&\"'!F22\")),0)","v":4},{"$f":"IFERROR(VALUE(INDIRECT(\"'\"&$A15&\"'!H22\")),0)","v":1},{"$f":"IFERROR(VALUE(INDIRECT(\"'\"&$A15&\"'!F23\")),0)","v":14},{"$f":"IFERROR(VALUE(INDIRECT(\"'\"&$A15&\"'!H23\")),0)","v":3},{"$f":"IFERROR(VALUE(INDIRECT(\"'\"&$A15&\"'!F24\")),0)","v":177},{"$f":"IFERROR(VALUE(INDIRECT(\"'\"&$A15&\"'!H24\")),0)","v":117},{"$f":"IFERROR(INDIRECT(\"'\"&$A15&\"'!AE22\"),\"\")","v":0},{"$f":"IFERROR(INDIRECT(\"'\"&$A15&\"'!AF22\"),\"\")","v":0}]
["ZAPISNIK_4_4",{"$f":"IFERROR(INDIRECT(\"'\"&$A16&\"'!B12\"),\"\")","v":"VAL SHARK"},{"$f":"IFERROR(INDIRECT(\"'\"&$A16&\"'!E12\"),\"\")","v":"BUZET 1"},{"$f":"IFERROR(VALUE(INDIRECT(\"'\"&$A16&\"'!F22\")),0)","v":4},{"$f":"IFERROR(VALUE(INDIRECT(\"'\"&$A16&\"'!H22\")),0)","v":0},{"$f":"IFERROR(VALUE(INDIRECT(\"'\"&$A16&\"'!F23\")),0)","v":12},{"$f":"IFERROR(VALUE(INDIRECT(\"'\"&$A16&\"'!H23\")),0)","v":4},{"$f":"IFERROR(VALUE(INDIRECT(\"'\"&$A16&\"'!F24\")),0)","v":156},{"$f":"IFERROR(VALUE(INDIRECT(\"'\"&$A16&\"'!H24\")),0)","v":124},{"$f":"IFERROR(INDIRECT(\"'\"&$A16&\"'!AE22\"),\"\")","v":0},{"$f":"IFERROR(INDIRECT(\"'\"&$A16&\"'!AF22\"),\"\")","v":0}]
["ZAPISNIK_4_5",{"$f":"IFERROR(INDIRECT(\"'\"&$A17&\"'!B12\"),\"\")","v":"BROVINJE 2"},{"$f":"IFERROR(INDIRECT(\"'\"&$A17&\"'!E12\"),\"\")","v":"PAZIN"},{"$f":"IFERROR(VALUE(INDIRECT(\"'\"&$A17&\"'!F22\")),0)","v":3},{"$f":"IFERROR(VALUE(INDIRECT(\"'\"&$A17&\"'!H22\")),0)","v":4},{"$f":"IFERROR(VALUE(INDIRECT(\"'\"&$A17&\"'!F23\")),0)","v":12},{"$f":"IFERROR(VALUE(INDIRECT(\"'\"&$A17&\"'!H23\")),0)","v":14},{"$f":"IFERROR(VALUE(INDIRECT(\"'\"&$A17&\"'!F24\")),0)","v":232},{"$f":"IFERROR(VALUE(INDIRECT(\"'\"&$A17&\"'!H24\")),0)","v":225},{"$f":"IFERROR(INDIRECT(\"'\"&$A17&\"'!AE22\"),\"\")","v":0},{"$f":"IFERROR(INDIRECT(\"'\"&$A17&\"'!AF22\"),\"\")","v":0}]
["ZAPISNIK_4_6",{"$f":"IFERROR(INDIRECT(\"'\"&$A18&\"'!B12\"),\"\")","v":"BROVINJE 2"},{"$f":"IFERROR(INDIRECT(\"'\"&$A18&\"'!E12\"),\"\")","v":"MAESTRAL 2"},{"$f":"IFERROR(VALUE(INDIRECT(\"'\"&$A18&\"'!F22\")),0)","v":4},{"$f":"IFERROR(VALUE(INDIRECT(\"'\"&$A18&\"'!H22\")),0)","v":1},{"$f":"IFERROR(VALUE(INDIRECT(\"'\"&$A18&\"'!F23\")),0)","v":14},{"$f":"IFERROR(VALUE(INDIRECT(\"'\"&$A18&\"'!H23\")),0)","v":4},{"$f":"IFERROR(VALUE(INDIRECT(\"'\"&$A18&\"'!F24\")),0)","v":188},{"$f":"IFERROR(VALUE(INDIRECT(\"'\"&$A18&\"'!H24\")),0)","v":117},{"$f":"IFERROR(INDIRECT(\"'\"&$A18&\"'!AE22\"),\"\")","v":0},{"$f":"IFERROR(INDIRECT(\"'\"&$A18&\"'!AF22\"),\"\")","v":0}]
["ZAPISNIK_5_1",{"$f":"IFERROR(INDIRECT(\"'\"&$A19&\"'!B12\"),\"\")","v":"BUZET 1"},{"$f":"IFERROR(INDIRECT(\"'\"&$A19&\"'!E12\"),\"\")","v":"BROVINJE 2"},{"$f":"IFERROR(VALUE(INDIRECT(\"'\"&$A19&\"'!F22\")),0)","v":3},{"$f":"IFERROR(VALUE(INDIRECT(\"'\"&$A19&\"'!H22\")),0)","v":4},{"$f":"IFERROR(VALUE(INDIRECT(\"'\"&$A19&\"'!F23\")),0)","v":11},{"$f":"IFERROR(VALUE(INDIRECT(\"'\"&$A19&\"'!H23\")),0)","v":16},{"$f":"IFERROR(VALUE(INDIRECT(\"'\"&$A19&\"'!F24\")),0)","v":240},{"$f":"IFERROR(VALUE(INDIRECT(\"'\"&$A19&\"'!H24\")),0)","v":254},{"$f":"IFERROR(INDIRECT(\"'\"&$A19&\"'!AE22\"),\"\")","v":0},{"$f":"IFERROR(INDIRECT(\"'\"&$A19&\"'!AF22\"),\"\")","v":0}]
["ZAPISNIK_5_2",{"$f":"IFERROR(INDIRECT(\"'\"&$A20&\"'!B12\"),\"\")","v":"BUZET 2"},{"$f":"IFERROR(INDIRECT(\"'\"&$A20&\"'!E12\"),\"\")","v":"BROVINJE 2"},{"$f":"IFERROR(VALUE(INDIRECT(\"'\"&$A20&\"'!F22\")),0)","v":0},{"$f":"IFERROR(VALUE(INDIRECT(\"'\"&$A20&\"'!H22\")),0)","v":4},{"$f":"IFERROR(VALUE(INDIRECT(\"'\"&$A20&\"'!F23\")),0)","v":3},{"$f":"IFERROR(VALUE(INDIRECT(\"'\"&$A20&\"'!H23\")),0)","v":12},{"$f":"IFERROR(VALUE(INDIRECT(\"'\"&$A20&\"'!F24\")),0)","v":118},{"$f":"IFERROR(VALUE(INDIRECT(\"'\"&$A20&\"'!H24\")),0)","v":162},{"$f":"IFERROR(INDIRECT(\"'\"&$A20&\"'!AE22\"),\"\")","v":0},{"$f":"IFERROR(INDIRECT(\"'\"&$A20&\"'!AF22\"),\"\")","v":0}]
["ZAPISNIK_5_3",{"$f":"IFERROR(INDIRECT(\"'\"&$A21&\"'!B12\"),\"\")","v":"MAESTRAL 2"},{"$f":"IFERROR(INDIRECT(\"'\"&$A21&\"'!E12\"),\"\")","v":"VAL SHARK"},{"$f":"IFERROR(VALUE(INDIRECT(\"'\"&$A21&\"'!F22\")),0)","v":4},{"$f":"IFERROR(VALUE(INDIRECT(\"'\"&$A21&\"'!H22\")),0)","v":2},{"$f":"IFERROR(VALUE(INDIRECT(\"'\"&$A21&\"'!F23\")),0)","v":13},{"$f":"IFERROR(VALUE(INDIRECT(\"'\"&$A21&\"'!H23\")),0)","v":11},{"$f":"IFERROR(VALUE(INDIRECT(\"'\"&$A21&\"'!F24\")),0)","v":229},{"$f":"IFERROR(VALUE(INDIRECT(\"'\"&$A21&\"'!H24\")),0)","v":239},{"$f":"IFERROR(INDIRECT(\"'\"&$A21&\"'!AE22\"),\"\")","v":0},{"$f":"IFERROR(INDIRECT(\"'\"&$A21&\"'!AF22\"),\"\")","v":0}]
["ZAPISNIK_5_4",{"$f":"IFERROR(INDIRECT(\"'\"&$A22&\"'!B12\"),\"\")","v":"MAESTRAL 2"},{"$f":"IFERROR(INDIRECT(\"'\"&$A22&\"'!E12\"),\"\")","v":"ARENA FERRO"},{"$f":"IFERROR(VALUE(INDIRECT(\"'\"&$A22&\"'!F22\")),0)","v":2},{"$f":"IFERROR(VALUE(INDIRECT(\"'\"&$A22&\"'!H22\")),0)","v":4},{"$f":"IFERROR(VALUE(INDIRECT(\"'\"&$A22&\"'!F23\")),0)","v":12},{"$f":"IFERROR(VALUE(INDIRECT(\"'\"&$A22&\"'!H23\")),0)","v":16},{"$f":"IFERROR(VALUE(INDIRECT(\"'\"&$A22&\"'!F24\")),0)","v":253},{"$f":"IFERROR(VALUE(INDIRECT(\"'\"&$A22&\"'!H24\")),0)","v":257},{"$f":"IFERROR(INDIRECT(\"'\"&$A22&\"'!AE22\"),\"\")","v":0},{"$f":"IFERROR(INDIRECT(\"'\"&$A22&\"'!AF22\"),\"\")","v":0}]
["ZAPISNIK_6_1",{"$f":"IFERROR(INDIRECT(\"'\"&$A23&\"'!B12\"),\"\")","v":""},{"$f":"IFERROR(INDIRECT(\"'\"&$A23&\"'!E12\"),\"\")","v":""},{"$f":"IFERROR(VALUE(INDIRECT(\"'\"&$A23&\"'!F22\")),0)","v":0},{"$f":"IFERROR(VALUE(INDIRECT(\"'\"&$A23&\"'!H22\")),0)","v":0},{"$f":"IFERROR(VALUE(INDIRECT(\"'\"&$A23&\"'!F23\")),0)","v":0},{"$f":"IFERROR(VALUE(INDIRECT(\"'\"&$A23&\"'!H23\")),0)","v":0},{"$f":"IFERROR(VALUE(INDIRECT(\"'\"&$A23&\"'!F24\")),0)","v":0},{"$f":"IFERROR(VALUE(INDIRECT(\"'\"&$A23&\"'!H24\")),0)","v":0},{"$f":"IFERROR(INDIRECT(\"'\"&$A23&\"'!AE22\"),\"\")","v":""},{"$f":"IFERROR(INDIRECT(\"'\"&$A23&\"'!AF22\"),\"\")","v":""}]
["ZAPISNIK_6_2",{"$f":"IFERROR(INDIRECT(\"'\"&$A24&\"'!B12\"),\"\")","v":""},{"$f":"IFERROR(INDIRECT(\"'\"&$A24&\"'!E12\"),\"\")","v":""},{"$f":"IFERROR(VALUE(INDIRECT(\"'\"&$A24&\"'!F22\")),0)","v":0},{"$f":"IFERROR(VALUE(INDIRECT(\"'\"&$A24&\"'!H22\")),0)","v":0},{"$f":"IFERROR(VALUE(INDIRECT(\"'\"&$A24&\"'!F23\")),0)","v":0},{"$f":"IFERROR(VALUE(INDIRECT(\"'\"&$A24&\"'!H23\")),0)","v":0},{"$f":"IFERROR(VALUE(INDIRECT(\"'\"&$A24&\"'!F24\")),0)","v":0},{"$f":"IFERROR(VALUE(INDIRECT(\"'\"&$A24&\"'!H24\")),0)","v":0},{"$f":"IFERROR(INDIRECT(\"'\"&$A24&\"'!AE22\"),\"\")","v":""},{"$f":"IFERROR(INDIRECT(\"'\"&$A24&\"'!AF22\"),\"\")","v":""}]
["ZAPISNIK_6_3",{"$f":"IFERROR(INDIRECT(\"'\"&$A25&\"'!B12\"),\"\")","v":""},{"$f":"IFERROR(INDIRECT(\"'\"&$A25&\"'!E12\"),\"\")","v":""},{"$f":"IFERROR(VALUE(INDIRECT(\"'\"&$A25&\"'!F22\")),0)","v":0},{"$f":"IFERROR(VALUE(INDIRECT(\"'\"&$A25&\"'!H22\")),0)","v":0},{"$f":"IFERROR(VALUE(INDIRECT(\"'\"&$A25&\"'!F23\")),0)","v":0},{"$f":"IFERROR(VALUE(INDIRECT(\"'\"&$A25&\"'!H23\")),0)","v":0},{"$f":"IFERROR(VALUE(INDIRECT(\"'\"&$A25&\"'!F24\")),0)","v":0},{"$f":"IFERROR(VALUE(INDIRECT(\"'\"&$A25&\"'!H24\")),0)","v":0},{"$f":"IFERROR(INDIRECT(\"'\"&$A25&\"'!AE22\"),\"\")","v":""},{"$f":"IFERROR(INDIRECT(\"'\"&$A25&\"'!AF22\"),\"\")","v":""}]
["ZAPISNIK_7_1",{"$f":"IFERROR(INDIRECT(\"'\"&$A26&\"'!B12\"),\"\")","v":""},{"$f":"IFERROR(INDIRECT(\"'\"&$A26&\"'!E12\"),\"\")","v":""},{"$f":"IFERROR(VALUE(INDIRECT(\"'\"&$A26&\"'!F22\")),0)","v":0},{"$f":"IFERROR(VALUE(INDIRECT(\"'\"&$A26&\"'!H22\")),0)","v":0},{"$f":"IFERROR(VALUE(INDIRECT(\"'\"&$A26&\"'!F23\")),0)","v":0},{"$f":"IFERROR(VALUE(INDIRECT(\"'\"&$A26&\"'!H23\")),0)","v":0},{"$f":"IFERROR(VALUE(INDIRECT(\"'\"&$A26&\"'!F24\")),0)","v":0},{"$f":"IFERROR(VALUE(INDIRECT(\"'\"&$A26&\"'!H24\")),0)","v":0},{"$f":"IFERROR(INDIRECT(\"'\"&$A26&\"'!AE22\"),\"\")","v":""},{"$f":"IFERROR(INDIRECT(\"'\"&$A26&\"'!AF22\"),\"\")","v":""}]
["ZAPISNIK_7_2",{"$f":"IFERROR(INDIRECT(\"'\"&$A27&\"'!B12\"),\"\")","v":""},{"$f":"IFERROR(INDIRECT(\"'\"&$A27&\"'!E12\"),\"\")","v":""},{"$f":"IFERROR(VALUE(INDIRECT(\"'\"&$A27&\"'!F22\")),0)","v":0},{"$f":"IFERROR(VALUE(INDIRECT(\"'\"&$A27&\"'!H22\")),0)","v":0},{"$f":"IFERROR(VALUE(INDIRECT(\"'\"&$A27&\"'!F23\")),0)","v":0},{"$f":"IFERROR(VALUE(INDIRECT(\"'\"&$A27&\"'!H23\")),0)","v":0},{"$f":"IFERROR(VALUE(INDIRECT(\"'\"&$A27&\"'!F24\")),0)","v":0},{"$f":"IFERROR(VALUE(INDIRECT(\"'\"&$A27&\"'!H24\")),0)","v":0},{"$f":"IFERROR(INDIRECT(\"'\"&$A27&\"'!AE22\"),\"\")","v":""},{"$f":"IFERROR(INDIRECT(\"'\"&$A27&\"'!AF22\"),\"\")","v":""}]
["ZAPISNIK_7_3",{"$f":"IFERROR(INDIRECT(\"'\"&$A28&\"'!B12\"),\"\")","v":""},{"$f":"IFERROR(INDIRECT(\"'\"&$A28&\"'!E12\"),\"\")","v":""},{"$f":"IFERROR(VALUE(INDIRECT(\"'\"&$A28&\"'!F22\")),0)","v":0},{"$f":"IFERROR(VALUE(INDIRECT(\"'\"&$A28&\"'!H22\")),0)","v":0},{"$f":"IFERROR(VALUE(INDIRECT(\"'\"&$A28&\"'!F23\")),0)","v":0},{"$f":"IFERROR(VALUE(INDIRECT(\"'\"&$A28&\"'!H23\")),0)","v":0},{"$f":"IFERROR(VALUE(INDIRECT(\"'\"&$A28&\"'!F24\")),0)","v":0},{"$f":"IFERROR(VALUE(INDIRECT(\"'\"&$A28&\"'!H24\")),0)","v":0},{"$f":"IFERROR(INDIRECT(\"'\"&$A28&\"'!AE22\"),\"\")","v":""},{"$f":"IFERROR(INDIRECT(\"'\"&$A28&\"'!AF22\"),\"\")","v":""}]
["ZAPISNIK_8_1",{"$f":"IFERROR(INDIRECT(\"'\"&$A29&\"'!B12\"),\"\")","v":""},{"$f":"IFERROR(INDIRECT(\"'\"&$A29&\"'!E12\"),\"\")","v":""},{"$f":"IFERROR(VALUE(INDIRECT(\"'\"&$A29&\"'!F22\")),0)","v":0},{"$f":"IFERROR(VALUE(INDIRECT(\"'\"&$A29&\"'!H22\")),0)","v":0},{"$f":"IFERROR(VALUE(INDIRECT(\"'\"&$A29&\"'!F23\")),0)","v":0},{"$f":"IFERROR(VALUE(INDIRECT(\"'\"&$A29&\"'!H23\")),0)","v":0},{"$f":"IFERROR(VALUE(INDIRECT(\"'\"&$A29&\"'!F24\")),0)","v":0},{"$f":"IFERROR(VALUE(INDIRECT(\"'\"&$A29&\"'!H24\")),0)","v":0},{"$f":"IFERROR(INDIRECT(\"'\"&$A29&\"'!AE22\"),\"\")","v":""},{"$f":"IFERROR(INDIRECT(\"'\"&$A29&\"'!AF22\"),\"\")","v":""}]
["ZAPISNIK_8_2",{"$f":"IFERROR(INDIRECT(\"'\"&$A30&\"'!B12\"),\"\")","v":""},{"$f":"IFERROR(INDIRECT(\"'\"&$A30&\"'!E12\"),\"\")","v":""},{"$f":"IFERROR(VALUE(INDIRECT(\"'\"&$A30&\"'!F22\")),0)","v":0},{"$f":"IFERROR(VALUE(INDIRECT(\"'\"&$A30&\"'!H22\")),0)","v":0},{"$f":"IFERROR(VALUE(INDIRECT(\"'\"&$A30&\"'!F23\")),0)","v":0},{"$f":"IFERROR(VALUE(INDIRECT(\"'\"&$A30&\"'!H23\")),0)","v":0},{"$f":"IFERROR(VALUE(INDIRECT(\"'\"&$A30&\"'!F24\")),0)","v":0},{"$f":"IFERROR(VALUE(INDIRECT(\"'\"&$A30&\"'!H24\")),0)","v":0},{"$f":"IFERROR(INDIRECT(\"'\"&$A30&\"'!AE22\"),\"\")","v":""},{"$f":"IFERROR(INDIRECT(\"'\"&$A30&\"'!AF22\"),\"\")","v":""}]
["ZAPISNIK_8_3",{"$f":"IFERROR(INDIRECT(\"'\"&$A31&\"'!B12\"),\"\")","v":""},{"$f":"IFERROR(INDIRECT(\"'\"&$A31&\"'!E12\"),\"\")","v":""},{"$f":"IFERROR(VALUE(INDIRECT(\"'\"&$A31&\"'!F22\")),0)","v":0},{"$f":"IFERROR(VALUE(INDIRECT(\"'\"&$A31&\"'!H22\")),0)","v":0},{"$f":"IFERROR(VALUE(INDIRECT(\"'\"&$A31&\"'!F23\")),0)","v":0},{"$f":"IFERROR(VALUE(INDIRECT(\"'\"&$A31&\"'!H23\")),0)","v":0},{"$f":"IFERROR(VALUE(INDIRECT(\"'\"&$A31&\"'!F24\")),0)","v":0},{"$f":"IFERROR(VALUE(INDIRECT(\"'\"&$A31&\"'!H24\")),0)","v":0},{"$f":"IFERROR(INDIRECT(\"'\"&$A31&\"'!AE22\"),\"\")","v":""},{"$f":"IFERROR(INDIRECT(\"'\"&$A31&\"'!AF22\"),\"\")","v":""}]
["ZAPISNIK_9_1",{"$f":"IFERROR(INDIRECT(\"'\"&$A32&\"'!B12\"),\"\")","v":""},{"$f":"IFERROR(INDIRECT(\"'\"&$A32&\"'!E12\"),\"\")","v":""},{"$f":"IFERROR(VALUE(INDIRECT(\"'\"&$A32&\"'!F22\")),0)","v":0},{"$f":"IFERROR(VALUE(INDIRECT(\"'\"&$A32&\"'!H22\")),0)","v":0},{"$f":"IFERROR(VALUE(INDIRECT(\"'\"&$A32&\"'!F23\")),0)","v":0},{"$f":"IFERROR(VALUE(INDIRECT(\"'\"&$A32&\"'!H23\")),0)","v":0},{"$f":"IFERROR(VALUE(INDIRECT(\"'\"&$A32&\"'!F24\")),0)","v":0},{"$f":"IFERROR(VALUE(INDIRECT(\"'\"&$A32&\"'!H24\")),0)","v":0},{"$f":"IFERROR(INDIRECT(\"'\"&$A32&\"'!AE22\"),\"\")","v":""},{"$f":"IFERROR(INDIRECT(\"'\"&$A32&\"'!AF22\"),\"\")","v":""}]
["ZAPISNIK_9_2",{"$f":"IFERROR(INDIRECT(\"'\"&$A33&\"'!B12\"),\"\")","v":""},{"$f":"IFERROR(INDIRECT(\"'\"&$A33&\"'!E12\"),\"\")","v":""},{"$f":"IFERROR(VALUE(INDIRECT(\"'\"&$A33&\"'!F22\")),0)","v":0},{"$f":"IFERROR(VALUE(INDIRECT(\"'\"&$A33&\"'!H22\")),0)","v":0},{"$f":"IFERROR(VALUE(INDIRECT(\"'\"&$A33&\"'!F23\")),0)","v":0},{"$f":"IFERROR(VALUE(INDIRECT(\"'\"&$A33&\"'!H23\")),0)","v":0},{"$f":"IFERROR(VALUE(INDIRECT(\"'\"&$A33&\"'!F24\")),0)","v":0},{"$f":"IFERROR(VALUE(INDIRECT(\"'\"&$A33&\"'!H24\")),0)","v":0},{"$f":"IFERROR(INDIRECT(\"'\"&$A33&\"'!AE22\"),\"\")","v":""},{"$f":"IFERROR(INDIRECT(\"'\"&$A33&\"'!AF22\"),\"\")","v":""}]
["ZAPISNIK_9_3",{"$f":"IFERROR(INDIRECT(\"'\"&$A34&\"'!B12\"),\"\")","v":""},{"$f":"IFERROR(INDIRECT(\"'\"&$A34&\"'!E12\"),\"\")","v":""},{"$f":"IFERROR(VALUE(INDIRECT(\"'\"&$A34&\"'!F22\")),0)","v":0},{"$f":"IFERROR(VALUE(INDIRECT(\"'\"&$A34&\"'!H22\")),0)","v":0},{"$f":"IFERROR(VALUE(INDIRECT(\"'\"&$A34&\"'!F23\")),0)","v":0},{"$f":"IFERROR(VALUE(INDIRECT(\"'\"&$A34&\"'!H23\")),0)","v":0},{"$f":"IFERROR(VALUE(INDIRECT(\"'\"&$A34&\"'!F24\")),0)","v":0},{"$f":"IFERROR(VALUE(INDIRECT(\"'\"&$A34&\"'!H24\")),0)","v":0},{"$f":"IFERROR(INDIRECT(\"'\"&$A34&\"'!AE22\"),\"\")","v":""},{"$f":"IFERROR(INDIRECT(\"'\"&$A34&\"'!AF22\"),\"\")","v":""}]
["ZAPISNIK_10_1",{"$f":"IFERROR(INDIRECT(\"'\"&$A35&\"'!B12\"),\"\")","v":""},{"$f":"IFERROR(INDIRECT(\"'\"&$A35&\"'!E12\"),\"\")","v":""},{"$f":"IFERROR(VALUE(INDIRECT(\"'\"&$A35&\"'!F22\")),0)","v":0},{"$f":"IFERROR(VALUE(INDIRECT(\"'\"&$A35&\"'!H22\")),0)","v":0},{"$f":"IFERROR(VALUE(INDIRECT(\"'\"&$A35&\"'!F23\")),0)","v":0},{"$f":"IFERROR(VALUE(INDIRECT(\"'\"&$A35&\"'!H23\")),0)","v":0},{"$f":"IFERROR(VALUE(INDIRECT(\"'\"&$A35&\"'!F24\")),0)","v":0},{"$f":"IFERROR(VALUE(INDIRECT(\"'\"&$A35&\"'!H24\")),0)","v":0},{"$f":"IFERROR(INDIRECT(\"'\"&$A35&\"'!AE22\"),\"\")","v":""},{"$f":"IFERROR(INDIRECT(\"'\"&$A35&\"'!AF22\"),\"\")","v":""}]
["ZAPISNIK_10_2",{"$f":"IFERROR(INDIRECT(\"'\"&$A36&\"'!B12\"),\"\")","v":""},{"$f":"IFERROR(INDIRECT(\"'\"&$A36&\"'!E12\"),\"\")","v":""},{"$f":"IFERROR(VALUE(INDIRECT(\"'\"&$A36&\"'!F22\")),0)","v":0},{"$f":"IFERROR(VALUE(INDIRECT(\"'\"&$A36&\"'!H22\")),0)","v":0},{"$f":"IFERROR(VALUE(INDIRECT(\"'\"&$A36&\"'!F23\")),0)","v":0},{"$f":"IFERROR(VALUE(INDIRECT(\"'\"&$A36&\"'!H23\")),0)","v":0},{"$f":"IFERROR(VALUE(INDIRECT(\"'\"&$A36&\"'!F24\")),0)","v":0},{"$f":"IFERROR(VALUE(INDIRECT(\"'\"&$A36&\"'!H24\")),0)","v":0},{"$f":"IFERROR(INDIRECT(\"'\"&$A36&\"'!AE22\"),\"\")","v":""},{"$f":"IFERROR(INDIRECT(\"'\"&$A36&\"'!AF22\"),\"\")","v":""}]
["ZAPISNIK_10_3",{"$f":"IFERROR(INDIRECT(\"'\"&$A37&\"'!B12\"),\"\")","v":""},{"$f":"IFERROR(INDIRECT(\"'\"&$A37&\"'!E12\"),\"\")","v":""},{"$f":"IFERROR(VALUE(INDIRECT(\"'\"&$A37&\"'!F22\")),0)","v":0},{"$f":"IFERROR(VALUE(INDIRECT(\"'\"&$A37&\"'!H22\")),0)","v":0},{"$f":"IFERROR(VALUE(INDIRECT(\"'\"&$A37&\"'!F23\")),0)","v":0},{"$f":"IFERROR(VALUE(INDIRECT(\"'\"&$A37&\"'!H23\")),0)","v":0},{"$f":"IFERROR(VALUE(INDIRECT(\"'\"&$A37&\"'!F24\")),0)","v":0},{"$f":"IFERROR(VALUE(INDIRECT(\"'\"&$A37&\"'!H24\")),0)","v":0},{"$f":"IFERROR(INDIRECT(\"'\"&$A37&\"'!AE22\"),\"\")","v":""},{"$f":"IFERROR(INDIRECT(\"'\"&$A37&\"'!AF22\"),\"\")","v":""}]

{"sheet":"POREDAK","index":28,"n_rows":10,"n_cols":25,"rows_kept":10,"cut":false,"hidden":true,"merged":[[1,9,1,10],[1,7,1,8],[1,5,1,6],[1,3,1,4],[0,0,0,11]]}
["ŽUPANIJSKA LIGA STSIŽ – 2025./2026.",null,null,null,null,null,null,null,null,null,null,null,"Broj ekipa"]
["RANG","KLUB","ODIGRANO","SKOR",null,"MEČ RAZLIKA",null,"SET RAZLIKA",null,"POEN RAZLIKA",null,"BOD",{"$f":"IFERROR('EKIPE I IGRAČI'!$B$2,0)","v":7}]
[1,{"$f":"'EKIPE I IGRAČI'!A7","v":"PAZIN"},{"$f":"COUNTIF(KOLA!B$2:B$37,B3)+COUNTIF(KOLA!C$2:C$37,B3)","v":6},{"$f":"SUMPRODUCT((KOLA!B$2:B$37=B3)*(KOLA!J$2:J$37<>\"N\")*(KOLA!D$2:D$37>KOLA!E$2:E$37)) + SUMPRODUCT((KOLA!C$2:C$37=B3)*(KOLA!K$2:K$37<>\"N\")*(KOLA!E$2:E$37>KOLA!D$2:D$37))","v":5},{"$f":"SUMPRODUCT((KOLA!B$2:B$37=B3)*(KOLA!J$2:J$37<>\"N\")*(KOLA!D$2:D$37<KOLA!E$2:E$37)) + SUMPRODUCT((KOLA!C$2:C$37=B3)*(KOLA!K$2:K$37<>\"N\")*(KOLA!E$2:E$37<KOLA!D$2:D$37))","v":1},{"$f":"SUMIF(KOLA!B$2:B$37,B3,KOLA!D$2:D$37)+SUMIF(KOLA!C$2:C$37,B3,KOLA!E$2:E$37)","v":21},{"$f":"SUMIF(KOLA!B$2:B$37,B3,KOLA!E$2:E$37)+SUMIF(KOLA!C$2:C$37,B3,KOLA!D$2:D$37)","v":12},{"$f":"SUMIF(KOLA!B$2:B$37,B3,KOLA!F$2:F$37)+SUMIF(KOLA!C$2:C$37,B3,KOLA!G$2:G$37)","v":71},{"$f":"SUMIF(KOLA!B$2:B$37,B3,KOLA!G$2:G$37)+SUMIF(KOLA!C$2:C$37,B3,KOLA!F$2:F$37)","v":53},{"$f":"SUMIF(KOLA!B$2:B$37,B3,KOLA!H$2:H$37)+SUMIF(KOLA!C$2:C$37,B3,KOLA!I$2:I$37)","v":1107},{"$f":"SUMIF(KOLA!B$2:B$37,B3,KOLA!I$2:I$37)+SUMIF(KOLA!C$2:C$37,B3,KOLA!H$2:H$37)","v":1037},{"$f":"D3*2+E3","v":11},0,11,0,0,0,11,"MEČ+","MEČ-","SET+","SET-","POEN+","POEN-","BOD"]
[2,{"$f":"'EKIPE I IGRAČI'!A2","v":"ARENA FERRO"},{"$f":"COUNTIF(KOLA!B$2:B$37,B4)+COUNTIF(KOLA!C$2:C$37,B4)","v":6},{"$f":"SUMPRODUCT((KOLA!B$2:B$37=B4)*(KOLA!J$2:J$37<>\"N\")*(KOLA!D$2:D$37>KOLA!E$2:E$37)) + SUMPRODUCT((KOLA!C$2:C$37=B4)*(KOLA!K$2:K$37<>\"N\")*(KOLA!E$2:E$37>KOLA!D$2:D$37))","v":4},{"$f":"SUMPRODUCT((KOLA!B$2:B$37=B4)*(KOLA!J$2:J$37<>\"N\")*(KOLA!D$2:D$37<KOLA!E$2:E$37)) + SUMPRODUCT((KOLA!C$2:C$37=B4)*(KOLA!K$2:K$37<>\"N\")*(KOLA!E$2:E$37<KOLA!D$2:D$37))","v":2},{"$f":"SUMIF(KOLA!B$2:B$37,B4,KOLA!D$2:D$37)+SUMIF(KOLA!C$2:C$37,B4,KOLA!E$2:E$37)","v":21},{"$f":"SUMIF(KOLA!B$2:B$37,B4,KOLA!E$2:E$37)+SUMIF(KOLA!C$2:C$37,B4,KOLA!D$2:D$37)","v":11},{"$f":"SUMIF(KOLA!B$2:B$37,B4,KOLA!F$2:F$37)+SUMIF(KOLA!C$2:C$37,B4,KOLA!G$2:G$37)","v":79},{"$f":"SUMIF(KOLA!B$2:B$37,B4,KOLA!G$2:G$37)+SUMIF(KOLA!C$2:C$37,B4,KOLA!F$2:F$37)","v":48},{"$f":"SUMIF(KOLA!B$2:B$37,B4,KOLA!H$2:H$37)+SUMIF(KOLA!C$2:C$37,B4,KOLA!I$2:I$37)","v":1223},{"$f":"SUMIF(KOLA!B$2:B$37,B4,KOLA!I$2:I$37)+SUMIF(KOLA!C$2:C$37,B4,KOLA!H$2:H$37)","v":1103},10,0,10,2,6,11,10]
[3,{"$f":"'EKIPE I IGRAČI'!A3","v":"BROVINJE 2"},{"$f":"COUNTIF(KOLA!B$2:B$37,B5)+COUNTIF(KOLA!C$2:C$37,B5)","v":6},{"$f":"SUMPRODUCT((KOLA!B$2:B$37=B5)*(KOLA!J$2:J$37<>\"N\")*(KOLA!D$2:D$37>KOLA!E$2:E$37)) + SUMPRODUCT((KOLA!C$2:C$37=B5)*(KOLA!K$2:K$37<>\"N\")*(KOLA!E$2:E$37>KOLA!D$2:D$37))","v":4},{"$f":"SUMPRODUCT((KOLA!B$2:B$37=B5)*(KOLA!J$2:J$37<>\"N\")*(KOLA!D$2:D$37<KOLA!E$2:E$37)) + SUMPRODUCT((KOLA!C$2:C$37=B5)*(KOLA!K$2:K$37<>\"N\")*(KOLA!E$2:E$37<KOLA!D$2:D$37))","v":2},{"$f":"SUMIF(KOLA!B$2:B$37,B5,KOLA!D$2:D$37)+SUMIF(KOLA!C$2:C$37,B5,KOLA!E$2:E$37)","v":20},{"$f":"SUMIF(KOLA!B$2:B$37,B5,KOLA!E$2:E$37)+SUMIF(KOLA!C$2:C$37,B5,KOLA!D$2:D$37)","v":14},{"$f":"SUMIF(KOLA!B$2:B$37,B5,KOLA!F$2:F$37)+SUMIF(KOLA!C$2:C$37,B5,KOLA!G$2:G$37)","v":74},{"$f":"SUMIF(KOLA!B$2:B$37,B5,KOLA!G$2:G$37)+SUMIF(KOLA!C$2:C$37,B5,KOLA!F$2:F$37)","v":55},{"$f":"SUMIF(KOLA!B$2:B$37,B5,KOLA!H$2:H$37)+SUMIF(KOLA!C$2:C$37,B5,KOLA!I$2:I$37)","v":1237},{"$f":"SUMIF(KOLA!B$2:B$37,B5,KOLA!I$2:I$37)+SUMIF(KOLA!C$2:C$37,B5,KOLA!H$2:H$37)","v":1104},10,0,10,-1,-3,-3,10]
[4,{"$f":"'EKIPE I IGRAČI'!A8","v":"VAL SHARK"},{"$f":"COUNTIF(KOLA!B$2:B$37,B6)+COUNTIF(KOLA!C$2:C$37,B6)","v":6},{"$f":"SUMPRODUCT((KOLA!B$2:B$37=B6)*(KOLA!J$2:J$37<>\"N\")*(KOLA!D$2:D$37>KOLA!E$2:E$37)) + SUMPRODUCT((KOLA!C$2:C$37=B6)*(KOLA!K$2:K$37<>\"N\")*(KOLA!E$2:E$37>KOLA!D$2:D$37))","v":4},{"$f":"SUMPRODUCT((KOLA!B$2:B$37=B6)*(KOLA!J$2:J$37<>\"N\")*(KOLA!D$2:D$37<KOLA!E$2:E$37)) + SUMPRODUCT((KOLA!C$2:C$37=B6)*(KOLA!K$2:K$37<>\"N\")*(KOLA!E$2:E$37<KOLA!D$2:D$37))","v":2},{"$f":"SUMIF(KOLA!B$2:B$37,B6,KOLA!D$2:D$37)+SUMIF(KOLA!C$2:C$37,B6,KOLA!E$2:E$37)","v":18},{"$f":"SUMIF(KOLA!B$2:B$37,B6,KOLA!E$2:E$37)+SUMIF(KOLA!C$2:C$37,B6,KOLA!D$2:D$37)","v":11},{"$f":"SUMIF(KOLA!B$2:B$37,B6,KOLA!F$2:F$37)+SUMIF(KOLA!C$2:C$37,B6,KOLA!G$2:G$37)","v":67},{"$f":"SUMIF(KOLA!B$2:B$37,B6,KOLA!G$2:G$37)+SUMIF(KOLA!C$2:C$37,B6,KOLA!F$2:F$37)","v":46},{"$f":"SUMIF(KOLA!B$2:B$37,B6,KOLA!H$2:H$37)+SUMIF(KOLA!C$2:C$37,B6,KOLA!I$2:I$37)","v":1101},{"$f":"SUMIF(KOLA!B$2:B$37,B6,KOLA!I$2:I$37)+SUMIF(KOLA!C$2:C$37,B6,KOLA!H$2:H$37)","v":971},10,0,10,-1,-3,-8,10]
[5,{"$f":"'EKIPE I IGRAČI'!A4","v":"BUZET 1"},{"$f":"COUNTIF(KOLA!B$2:B$37,B7)+COUNTIF(KOLA!C$2:C$37,B7)","v":6},{"$f":"SUMPRODUCT((KOLA!B$2:B$37=B7)*(KOLA!J$2:J$37<>\"N\")*(KOLA!D$2:D$37>KOLA!E$2:E$37)) + SUMPRODUCT((KOLA!C$2:C$37=B7)*(KOLA!K$2:K$37<>\"N\")*(KOLA!E$2:E$37>KOLA!D$2:D$37))","v":2},{"$f":"SUMPRODUCT((KOLA!B$2:B$37=B7)*(KOLA!J$2:J$37<>\"N\")*(KOLA!D$2:D$37<KOLA!E$2:E$37)) + SUMPRODUCT((KOLA!C$2:C$37=B7)*(KOLA!K$2:K$37<>\"N\")*(KOLA!E$2:E$37<KOLA!D$2:D$37))","v":4},{"$f":"SUMIF(KOLA!B$2:B$37,B7,KOLA!D$2:D$37)+SUMIF(KOLA!C$2:C$37,B7,KOLA!E$2:E$37)","v":13},{"$f":"SUMIF(KOLA!B$2:B$37,B7,KOLA!E$2:E$37)+SUMIF(KOLA!C$2:C$37,B7,KOLA!D$2:D$37)","v":17},{"$f":"SUMIF(KOLA!B$2:B$37,B7,KOLA!F$2:F$37)+SUMIF(KOLA!C$2:C$37,B7,KOLA!G$2:G$37)","v":49},{"$f":"SUMIF(KOLA!B$2:B$37,B7,KOLA!G$2:G$37)+SUMIF(KOLA!C$2:C$37,B7,KOLA!F$2:F$37)","v":59},{"$f":"SUMIF(KOLA!B$2:B$37,B7,KOLA!H$2:H$37)+SUMIF(KOLA!C$2:C$37,B7,KOLA!I$2:I$37)","v":959},{"$f":"SUMIF(KOLA!B$2:B$37,B7,KOLA!I$2:I$37)+SUMIF(KOLA!C$2:C$37,B7,KOLA!H$2:H$37)","v":979},8,0,8,0,0,0,8]
[6,{"$f":"'EKIPE I IGRAČI'!A5","v":"BUZET 2"},{"$f":"COUNTIF(KOLA!B$2:B$37,B8)+COUNTIF(KOLA!C$2:C$37,B8)","v":6},{"$f":"SUMPRODUCT((KOLA!B$2:B$37=B8)*(KOLA!J$2:J$37<>\"N\")*(KOLA!D$2:D$37>KOLA!E$2:E$37)) + SUMPRODUCT((KOLA!C$2:C$37=B8)*(KOLA!K$2:K$37<>\"N\")*(KOLA!E$2:E$37>KOLA!D$2:D$37))","v":1},{"$f":"SUMPRODUCT((KOLA!B$2:B$37=B8)*(KOLA!J$2:J$37<>\"N\")*(KOLA!D$2:D$37<KOLA!E$2:E$37)) + SUMPRODUCT((KOLA!C$2:C$37=B8)*(KOLA!K$2:K$37<>\"N\")*(KOLA!E$2:E$37<KOLA!D$2:D$37))","v":5},{"$f":"SUMIF(KOLA!B$2:B$37,B8,KOLA!D$2:D$37)+SUMIF(KOLA!C$2:C$37,B8,KOLA!E$2:E$37)","v":7},{"$f":"SUMIF(KOLA!B$2:B$37,B8,KOLA!E$2:E$37)+SUMIF(KOLA!C$2:C$37,B8,KOLA!D$2:D$37)","v":20},{"$f":"SUMIF(KOLA!B$2:B$37,B8,KOLA!F$2:F$37)+SUMIF(KOLA!C$2:C$37,B8,KOLA!G$2:G$37)","v":29},{"$f":"SUMIF(KOLA!B$2:B$37,B8,KOLA!G$2:G$37)+SUMIF(KOLA!C$2:C$37,B8,KOLA!F$2:F$37)","v":66},{"$f":"SUMIF(KOLA!B$2:B$37,B8,KOLA!H$2:H$37)+SUMIF(KOLA!C$2:C$37,B8,KOLA!I$2:I$37)","v":760},{"$f":"SUMIF(KOLA!B$2:B$37,B8,KOLA!I$2:I$37)+SUMIF(KOLA!C$2:C$37,B8,KOLA!H$2:H$37)","v":958},7,0,7,4,8,27,7]
[7,{"$f":"'EKIPE I IGRAČI'!A6","v":"MAESTRAL 2"},{"$f":"COUNTIF(KOLA!B$2:B$37,B9)+COUNTIF(KOLA!C$2:C$37,B9)","v":6},{"$f":"SUMPRODUCT((KOLA!B$2:B$37=B9)*(KOLA!J$2:J$37<>\"N\")*(KOLA!D$2:D$37>KOLA!E$2:E$37)) + SUMPRODUCT((KOLA!C$2:C$37=B9)*(KOLA!K$2:K$37<>\"N\")*(KOLA!E$2:E$37>KOLA!D$2:D$37))","v":1},{"$f":"SUMPRODUCT((KOLA!B$2:B$37=B9)*(KOLA!J$2:J$37<>\"N\")*(KOLA!D$2:D$37<KOLA!E$2:E$37)) + SUMPRODUCT((KOLA!C$2:C$37=B9)*(KOLA!K$2:K$37<>\"N\")*(KOLA!E$2:E$37<KOLA!D$2:D$37))","v":5},{"$f":"SUMIF(KOLA!B$2:B$37,B9,KOLA!D$2:D$37)+SUMIF(KOLA!C$2:C$37,B9,KOLA!E$2:E$37)","v":7},{"$f":"SUMIF(KOLA!B$2:B$37,B9,KOLA!E$2:E$37)+SUMIF(KOLA!C$2:C$37,B9,KOLA!D$2:D$37)","v":22},{"$f":"SUMIF(KOLA!B$2:B$37,B9,KOLA!F$2:F$37)+SUMIF(KOLA!C$2:C$37,B9,KOLA!G$2:G$37)","v":35},{"$f":"SUMIF(KOLA!B$2:B$37,B9,KOLA!G$2:G$37)+SUMIF(KOLA!C$2:C$37,B9,KOLA!F$2:F$37)","v":77},{"$f":"SUMIF(KOLA!B$2:B$37,B9,KOLA!H$2:H$37)+SUMIF(KOLA!C$2:C$37,B9,KOLA!I$2:I$37)","v":898},{"$f":"SUMIF(KOLA!B$2:B$37,B9,KOLA!I$2:I$37)+SUMIF(KOLA!C$2:C$37,B9,KOLA!H$2:H$37)","v":1133},7,0,7,-4,-8,-27,7]
[null,null,null,null,null,null,null,null,null,null,null,null,null,null,{"$f":"_xludf.LET(\nt,$B$10,\nsh,Zapisnici,\nht,_xludf.MAP(sh,_xludf.LAMBDA(s,INDIRECT(\"'\"&s&\"'!A12\"))),\nat,_xludf.MAP(sh,_xludf.LAMBDA(s,INDIRECT(\"'\"&s&\"'!C12\"))),\nhw,_xludf.MAP(sh,_xludf.LAMBDA(s,INDIRECT(\"'\"&s&\"'!E12\"))),\naw,_xludf.MAP(sh,_xludf.LAMBDA(s,INDIRECT(\"'\"&s&\"'!H12\"))),\nhN,_xludf.MAP(sh,_xludf.LAMBDA(s,INDIRECT(\"'\"&s&\"'!F12\"))),\naN,_xludf.MAP(sh,_xludf.LAMBDA(s,INDIRECT(\"'\"&s&\"'!I12\"))),\nhs,_xludf.MAP(sh,_xludf.LAMBDA(s,INDIRECT(\"'\"&s&\"'!J12\"))),\nas,_xludf.MAP(sh,_xludf.LAMBDA(s,INDIRECT(\"'\"&s&\"'!L12\"))),\nhp,_xludf.MAP(sh,_xludf.LAMBDA(s,INDIRECT(\"'\"&s&\"'!N12\"))),\nap,_xludf.MAP(sh,_xludf.LAMBDA(s,INDIRECT(\"'\"&s&\"'!P12\"))),\nplayed,SUM((ht=t)*(hN<>\"N\") + (at=t)*(aN<>\"N\")),\nwins,SUM((ht=t)*(hN<>\"N\")*(hw>aw) + (at=t)*(aN<>\"N\")*(aw>hw)),\nloss,SUM((ht=t)*(hN<>\"N\")*(hw<aw) + (at=t)*(aN<>\"N\")*(aw<hw)),\nmatch_for,SUM((ht=t)*hw + (at=t)*aw),\nmatch_ag,SUM((ht=t)*aw + (at=t)*hw),\nset_for,SUM((ht=t)*hs + (at=t)*as),\nset_ag,SUM((ht=t)*as + (at=t)*hs),\npt_for,SUM((ht=t)*hp + (at=t)*ap),\npt_ag,SUM((ht=t)*ap + (at=t)*hp),\nbod,SUM( (ht=t)*(hN<>\"N\")*IF(hw>aw,2,1) + (at=t)*(aN<>\"N\")*IF(aw>hw,2,1) ),\nCHOOSE({1},t,played,wins,loss,match_for,match_ag,set_for,set_ag,pt_for,pt_ag,bod)\n)","v":{"$error":"#NAME?"}}]

{"sheet":"DASHBOARD","index":29,"n_rows":30,"n_cols":27,"rows_kept":30,"cut":false,"hidden":true,"merged":[]}
["DASHBOARD – FORMA PO KOLIMA"]
["Odaberi ekipu:","VAL SHARK",null,null,null,null,null,null,null,null,null,null,null,null,null,null,null,null,null,null,null,null,null,null,null,null,"PAZIN"]
[null,null,null,null,null,null,null,null,null,null,null,null,null,null,null,null,null,null,null,null,null,null,null,null,null,null,"ARENA FERRO"]
["KLUB","K1","K2","K3","K4","K5","K6","K7","K8","K9","K10","STREAK",null,null,null,null,null,null,null,null,null,null,null,null,null,null,"BROVINJE 2"]
["PAZIN","W 4:0","W 4:1","W 4:3","W 4:3",null,null,null,null,null,null,"W4",null,null,null,null,null,null,null,null,null,null,null,null,null,null,"VAL SHARK"]
["ARENA FERRO","W 4:0","L 2:4","L 3:4","W 4:0","W 4:2",null,null,null,null,null,"W2",null,null,null,null,null,null,null,null,null,null,null,null,null,null,"BUZET 1"]
["BROVINJE 2",null,"W 4:2",null,"W 4:1","W 4:0",null,null,null,null,null,"W3",null,null,null,null,null,null,null,null,null,null,null,null,null,null,"BUZET 2"]
["VAL SHARK","L 0:4","W 4:1","W 4:1","W 4:0","L 2:4",null,null,null,null,null,"L1",null,null,null,null,null,null,null,null,null,null,null,null,null,null,"MAESTRAL 2"]
["BUZET 1","W 4:1","L 1:4","W 4:0","L 0:4","L 3:4",null,null,null,null,null,"L2"]
["BUZET 2","L 1:4","L 1:4","W 4:0","L 1:4","L 0:4",null,null,null,null,null,"L2"]
["MAESTRAL 2","L 0:4",null,"L 0:4","L 1:4","L 2:4",null,null,null,null,null,"L4"]
[]
[]
[]
[]
[]
[]
[]
[]
["Kolo","Kumulativni bodovi"]
[1,1]
[2,3]
[3,5]
[4,7]
[5,8]
[6,8]
[7,8]
[8,8]
[9,8]
[10,8]

{"sheet":"SKOROVI IGRAČA POJEDINAČNO","index":30,"n_rows":38,"n_cols":7,"rows_kept":38,"cut":false,"hidden":true,"merged":[[0,0,0,6]]}
["ŽUPANIJSKA LIGA 25./26. - SKOROVI IGRAČA POJEDINAČNO"]
["RANG","PREZIME I IME","KLUB","ODIGRANO","POBJEDA","PORAZ","%"]
[1,"GASPARI HUDOLETNJAK Matija","BROVINJE 2",9,9,0,1]
[2,"INFANTOLINO Davide","VAL SHARK",10,9,1,0.9]
[3,"GLAVINIĆ Denis","PAZIN",9,8,1,0.88888888888888884]
[4,"CINKOPAN Kristijan","ARENA FERRO",9,7,2,0.77777777777777779]
[5,"BASIACO Leonida","BROVINJE 2",9,6,3,0.66666666666666663]
[6,"FABRIS Karlo","PAZIN",7,5,2,0.7142857142857143]
[7,"HRVANOVIĆ Jasmin","VAL SHARK",5,3,2,0.6]
[8,"LUKEZ Goran","PAZIN",5,3,2,0.6]
[9,"DRAŠĆIĆ Petar","BUZET 2",6,3,3,0.5]
[10,"FABIJAN Damir","PAZIN",6,3,3,0.5]
[11,"KRANJC Dino","ARENA FERRO",6,3,3,0.5]
[12,"SINČIĆ Luana","MAESTRAL 2",6,3,3,0.5]
[13,"BERDNYK Stanislav","BUZET 1",7,3,4,0.42857142857142855]
[14,"BENAZIĆ Sandro","BROVINJE 2",9,3,6,0.33333333333333331]
[15,"SIROTIĆ Kevin","BUZET 1",2,2,0,1]
[16,"KRIŠTO Tomislav","ARENA FERRO",4,2,2,0.5]
[17,"PEROŠ Ana","MAESTRAL 2",4,2,2,0.5]
[18,"PAULUS Michael","BUZET 1",5,2,3,0.4]
[19,"IVINIĆ Serđo","VAL SHARK",6,2,4,0.33333333333333331]
[20,"PEKICA Bartol","ARENA FERRO",1,1,0,1]
[21,"VALE Damir","ARENA FERRO",1,1,0,1]
[22,"DELEVIĆ Predrag","VAL SHARK",2,1,1,0.5]
[23,"VINOVRŠKI Jenisej","ARENA FERRO",2,1,1,0.5]
[24,"KOS Dino","BUZET 2",4,1,3,0.25]
[25,"KRANČIĆ Filip","BUZET 1",4,1,3,0.25]
[26,"SIROTIĆ Aleš","BUZET 1",6,1,5,0.16666666666666666]
[27,"PAVLETIĆ Guido","BUZET 2",7,1,6,0.14285714285714285]
[28,"KMET Teo","MAESTRAL 2",4,0,4,0]
[29,"VIŽINTIN Marino","MAESTRAL 2",4,0,4,0]
[30,"BOŠNJAKOVIĆ Dubravko","BUZET 2",3,0,3,0]
[31,"KELEMEN Mićo","ARENA FERRO",3,0,3,0]
[32,"SMAIĆ Bruno","MAESTRAL 2",3,0,3,0]
[33,"FLEGO Valter","BUZET 2",1,0,1,0]
[34,"HANZL Tomislav","MAESTRAL 2",1,0,1,0]
[35,"MILAKOVIĆ Borna","MAESTRAL 2",1,0,1,0]
[36,"STIPIĆ Matea","BROVINJE 2",1,0,1,0]

{"sheet":"SKOROVI PAROVA","index":31,"n_rows":27,"n_cols":7,"rows_kept":27,"cut":false,"hidden":true,"merged":[[0,0,0,6]]}
["ŽUPANIJSKA LIGA 25./26. - SKOROVI PAROVA"]
["RANG","PAR","KLUB","ODIGRANO","POBJEDA","PORAZ","%"]
[1,"CINKOPAN K. + KRANJC D.","ARENA FERRO",3,3,0,1]
[2,"BERDNYK S. + PAULUS M.","BUZET 1",2,2,0,1]
[3,"BASIACO L. + GASPARI HUDOLETNJAK","BROVINJE 2",4,2,2,0.5]
[4,"GLAVINIĆ D. + LUKEZ G.","PAZIN",4,2,2,0.5]
[5,"HRVANOVIĆ J. + IVINIĆ S.","VAL SHARK",4,2,2,0.5]
[6,"BERDNYK S. + SIROTIĆ K.","BUZET 1",1,1,0,1]
[7,"CINKOPAN K. + KELEMEN M.","ARENA FERRO",1,1,0,1]
[8,"CINKOPAN K. + PEKICA B.","ARENA FERRO",1,1,0,1]
[9,"DRAŠĆIĆ P. + KOS D.","BUZET 2",1,1,0,1]
[10,"HRVANOVIĆ J. + INFANTOLINO D.","VAL SHARK",1,1,0,1]
[11,"KELEMEN M. + KRANJC D.","ARENA FERRO",1,1,0,1]
[12,"KMET T. + VIŽINTIN M.","MAESTRAL 2",1,1,0,1]
[13,"KOS D. + PAVLETIĆ G.","BUZET 2",1,1,0,1]
[14,"KRANČIĆ F. + SIROTIĆ A.","BUZET 1",2,1,1,0.5]
[15,"PEROŠ A. + SINČIĆ L.","MAESTRAL 2",2,1,1,0.5]
[16,"DRAŠĆIĆ P. + PAVLETIĆ G.","BUZET 2",3,0,3,0]
[17,"FABIJAN D. + GLAVINIĆ D.","PAZIN",2,0,2,0]
[18,"BASIACO L. + BENAZIĆ S.","BROVINJE 2",1,0,1,0]
[19,"BENAZIĆ S. + GASPARI HUDOLETNJAK","BROVINJE 2",1,0,1,0]
[20,"BERDNYK S. + SIROTIĆ A.","BUZET 1",1,0,1,0]
[21,"DELEVIĆ P. + IVINIĆ S.","VAL SHARK",1,0,1,0]
[22,"FLEGO V. + KOS D.","BUZET 2",1,0,1,0]
[23,"HANZL T. + KMET T.","MAESTRAL 2",1,0,1,0]
[24,"KMET T. + SINČIĆ L.","MAESTRAL 2",1,0,1,0]
[25,"MILAKOVIĆ B. + SINČIĆ L.","MAESTRAL 2",1,0,1,0]

{"sheet":"VRIJEME","index":32,"n_rows":25,"n_cols":1,"rows_kept":25,"cut":false,"hidden":true,"merged":[]}
["09:00:00"]
["09:30:00"]
["10:00:00"]
["10:30:00"]
["11:00:00"]
["11:30:00"]
["12:00:00"]
["12:30:00"]
["13:00:00"]
["13:30:00"]
["14:00:00"]
["14:30:00"]
["15:00:00"]
["15:30:00"]
["16:00:00"]
["16:30:00"]
["17:00:00"]
["17:30:00"]
["18:00:00"]
["18:30:00"]
["19:00:00"]
["19:30:00"]
["20:00:00"]
["20:30:00"]
["21:00:00"]

{"sheet":"KALENDAR","index":33,"n_rows":303,"n_cols":1,"rows_kept":303,"cut":false,"hidden":true,"merged":[]}
["1. 9. 2025."]
["2. 9. 2025."]
["3. 9. 2025."]
["4. 9. 2025."]
["5. 9. 2025."]
["6. 9. 2025."]
["7. 9. 2025."]
["8. 9. 2025."]
["9. 9. 2025."]
["10. 9. 2025."]
["11. 9. 2025."]
["12. 9. 2025."]
["13. 9. 2025."]
["14. 9. 2025."]
["15. 9. 2025."]
["16. 9. 2025."]
["17. 9. 2025."]
["18. 9. 2025."]
["19. 9. 2025."]
["20. 9. 2025."]
["21. 9. 2025."]
["22. 9. 2025."]
["23. 9. 2025."]
["24. 9. 2025."]
["25. 9. 2025."]
["26. 9. 2025."]
["27. 9. 2025."]
["28. 9. 2025."]
["29. 9. 2025."]
["30. 9. 2025."]
["1. 10. 2025."]
["2. 10. 2025."]
["3. 10. 2025."]
["4. 10. 2025."]
["5. 10. 2025."]
["6. 10. 2025."]
["7. 10. 2025."]
["8. 10. 2025."]
["9. 10. 2025."]
["10. 10. 2025."]
["11. 10. 2025."]
["12. 10. 2025."]
["13. 10. 2025."]
["14. 10. 2025."]
["15. 10. 2025."]
["16. 10. 2025."]
["17. 10. 2025."]
["18. 10. 2025."]
["19. 10. 2025."]
["20. 10. 2025."]
["21. 10. 2025."]
["22. 10. 2025."]
["23. 10. 2025."]
["24. 10. 2025."]
["25. 10. 2025."]
["26. 10. 2025."]
["27. 10. 2025."]
["28. 10. 2025."]
["29. 10. 2025."]
["30. 10. 2025."]
["31. 10. 2025."]
["1. 11. 2025."]
["2. 11. 2025."]
["3. 11. 2025."]
["4. 11. 2025."]
["5. 11. 2025."]
["6. 11. 2025."]
["7. 11. 2025."]
["8. 11. 2025."]
["9. 11. 2025."]
["10. 11. 2025."]
["11. 11. 2025."]
["12. 11. 2025."]
["13. 11. 2025."]
["14. 11. 2025."]
["15. 11. 2025."]
["16. 11. 2025."]
["17. 11. 2025."]
["18. 11. 2025."]
["19. 11. 2025."]
["20. 11. 2025."]
["21. 11. 2025."]
["22. 11. 2025."]
["23. 11. 2025."]
["24. 11. 2025."]
["25. 11. 2025."]
["26. 11. 2025."]
["27. 11. 2025."]
["28. 11. 2025."]
["29. 11. 2025."]
["30. 11. 2025."]
["1. 12. 2025."]
["2. 12. 2025."]
["3. 12. 2025."]
["4. 12. 2025."]
["5. 12. 2025."]
["6. 12. 2025."]
["7. 12. 2025."]
["8. 12. 2025."]
["9. 12. 2025."]
["10. 12. 2025."]
["11. 12. 2025."]
["12. 12. 2025."]
["13. 12. 2025."]
["14. 12. 2025."]
["15. 12. 2025."]
["16. 12. 2025."]
["17. 12. 2025."]
["18. 12. 2025."]
["19. 12. 2025."]
["20. 12. 2025."]
["21. 12. 2025."]
["22. 12. 2025."]
["23. 12. 2025."]
["24. 12. 2025."]
["25. 12. 2025."]
["26. 12. 2025."]
["27. 12. 2025."]
["28. 12. 2025."]
["29. 12. 2025."]
["30. 12. 2025."]
["31. 12. 2025."]
["1. 1. 2026."]
["2. 1. 2026."]
["3. 1. 2026."]
["4. 1. 2026."]
["5. 1. 2026."]
["6. 1. 2026."]
["7. 1. 2026."]
["8. 1. 2026."]
["9. 1. 2026."]
["10. 1. 2026."]
["11. 1. 2026."]
["12. 1. 2026."]
["13. 1. 2026."]
["14. 1. 2026."]
["15. 1. 2026."]
["16. 1. 2026."]
["17. 1. 2026."]
["18. 1. 2026."]
["19. 1. 2026."]
["20. 1. 2026."]
["21. 1. 2026."]
["22. 1. 2026."]
["23. 1. 2026."]
["24. 1. 2026."]
["25. 1. 2026."]
["26. 1. 2026."]
["27. 1. 2026."]
["28. 1. 2026."]
["29. 1. 2026."]
["30. 1. 2026."]
["31. 1. 2026."]
["1. 2. 2026."]
["2. 2. 2026."]
["3. 2. 2026."]
["4. 2. 2026."]
["5. 2. 2026."]
["6. 2. 2026."]
["7. 2. 2026."]
["8. 2. 2026."]
["9. 2. 2026."]
["10. 2. 2026."]
["11. 2. 2026."]
["12. 2. 2026."]
["13. 2. 2026."]
["14. 2. 2026."]
["15. 2. 2026."]
["16. 2. 2026."]
["17. 2. 2026."]
["18. 2. 2026."]
["19. 2. 2026."]
["20. 2. 2026."]
["21. 2. 2026."]
["22. 2. 2026."]
["23. 2. 2026."]
["24. 2. 2026."]
["25. 2. 2026."]
["26. 2. 2026."]
["27. 2. 2026."]
["28. 2. 2026."]
["1. 3. 2026."]
["2. 3. 2026."]
["3. 3. 2026."]
["4. 3. 2026."]
["5. 3. 2026."]
["6. 3. 2026."]
["7. 3. 2026."]
["8. 3. 2026."]
["9. 3. 2026."]
["10. 3. 2026."]
["11. 3. 2026."]
["12. 3. 2026."]
["13. 3. 2026."]
["14. 3. 2026."]
["15. 3. 2026."]
["16. 3. 2026."]
["17. 3. 2026."]
["18. 3. 2026."]
["19. 3. 2026."]
["20. 3. 2026."]
["21. 3. 2026."]
["22. 3. 2026."]
["23. 3. 2026."]
["24. 3. 2026."]
["25. 3. 2026."]
["26. 3. 2026."]
["27. 3. 2026."]
["28. 3. 2026."]
["29. 3. 2026."]
["30. 3. 2026."]
["31. 3. 2026."]
["1. 4. 2026."]
["2. 4. 2026."]
["3. 4. 2026."]
["4. 4. 2026."]
["5. 4. 2026."]
["6. 4. 2026."]
["7. 4. 2026."]
["8. 4. 2026."]
["9. 4. 2026."]
["10. 4. 2026."]
["11. 4. 2026."]
["12. 4. 2026."]
["13. 4. 2026."]
["14. 4. 2026."]
["15. 4. 2026."]
["16. 4. 2026."]
["17. 4. 2026."]
["18. 4. 2026."]
["19. 4. 2026."]
["20. 4. 2026."]
["21. 4. 2026."]
["22. 4. 2026."]
["23. 4. 2026."]
["24. 4. 2026."]
["25. 4. 2026."]
["26. 4. 2026."]
["27. 4. 2026."]
["28. 4. 2026."]
["29. 4. 2026."]
["30. 4. 2026."]
["1. 5. 2026."]
["2. 5. 2026."]
["3. 5. 2026."]
["4. 5. 2026."]
["5. 5. 2026."]
["6. 5. 2026."]
["7. 5. 2026."]
["8. 5. 2026."]
["9. 5. 2026."]
["10. 5. 2026."]
["11. 5. 2026."]
["12. 5. 2026."]
["13. 5. 2026."]
["14. 5. 2026."]
["15. 5. 2026."]
["16. 5. 2026."]
["17. 5. 2026."]
["18. 5. 2026."]
["19. 5. 2026."]
["20. 5. 2026."]
["21. 5. 2026."]
["22. 5. 2026."]
["23. 5. 2026."]
["24. 5. 2026."]
["25. 5. 2026."]
["26. 5. 2026."]
["27. 5. 2026."]
["28. 5. 2026."]
["29. 5. 2026."]
["30. 5. 2026."]
["31. 5. 2026."]
["1. 6. 2026."]
["2. 6. 2026."]
["3. 6. 2026."]
["4. 6. 2026."]
["5. 6. 2026."]
["6. 6. 2026."]
["7. 6. 2026."]
["8. 6. 2026."]
["9. 6. 2026."]
["10. 6. 2026."]
["11. 6. 2026."]
["12. 6. 2026."]
["13. 6. 2026."]
["14. 6. 2026."]
["15. 6. 2026."]
["16. 6. 2026."]
["17. 6. 2026."]
["18. 6. 2026."]
["19. 6. 2026."]
["20. 6. 2026."]
["21. 6. 2026."]
["22. 6. 2026."]
["23. 6. 2026."]
["24. 6. 2026."]
["25. 6. 2026."]
["26. 6. 2026."]
["27. 6. 2026."]
["28. 6. 2026."]
["29. 6. 2026."]
["30. 6. 2026."]

{"sheet":"BILTEN_1_1","index":34,"n_rows":24,"n_cols":27,"rows_kept":24,"cut":false,"hidden":true,"merged":[[2,23,2,26],[0,0,0,26],[1,1,1,3],[1,4,1,8],[1,9,1,12],[1,13,1,18],[1,19,1,22],[1,23,1,26],[2,1,2,3],[2,4,2,8],[2,9,2,12],[2,13,2,18],[2,19,2,22]]}
["ŽUPANIJSKA LIGA STSIŽ 2025./2026 -  1. kolo — 21.11.2025."]
[null,"GRAD DOMAĆIN",null,null,"DVORANA",null,null,null,null,"KOLO",null,null,null,"DATUM",null,null,null,null,null,"SAT"]
[null,"PAZIN",null,null,"Sportska dvorana Pazin",null,null,null,null,"1.",null,null,null,"18. 10. 2025.",null,null,null,null,null,"17:00:00"]
["Domaćin","PAZIN",null,"Gost","MAESTRAL 2"]
["A","GLAVINIĆ Denis",null,"X","MILAKOVIĆ Borna"]
["B","FABRIS Karlo",null,"Y","SINČIĆ Luana"]
["C","LUKEZ Goran",null,"Z","SMAIĆ Bruno",null,null,null,null,null," "]
["R1",null,null,"R1"]
["R2",null,null,"R2"]
[]
[null,"DOMAĆIN",null,null,"GOST"]
[null,"PAZIN",null,null,"MAESTRAL 2"]
[null,"GLAVINIĆ Denis","A","X","MILAKOVIĆ Borna",12,null,10,11,null,6,11,null,9,null,null,null,null,null,null,null,3,":",0,1,":",0]
[null,"FABRIS Karlo","B","Y","SINČIĆ Luana",6,null,11,11,null,5,11,null,5,11,null,2,null,null,null,null,3,":",1,2,":",0]
[null,"LUKEZ Goran","C","Z","SMAIĆ Bruno",9,null,11,11,null,2,11,null,8,11,null,5,null,null,null,null,3,":",1,3,":",0]
[null,"GLAVINIĆ D., LUKEZ G.","PAR","PAR","MILAKOVIĆ B., SINČIĆ L.",11,null,6,11,null,7,11,null,5,null,null,null,null,null,null,null,3,":",0,4,":",0]
[null,null,null,null,null,null,null,null,null,null,null,null,null,null,null,null,null,null,null,null,null,"",":","","",":",""]
[null,null,"A","Y",null,null,null,null,null,null,null,null,null,null,null,null,null,null,null,null,null,"",":","","",":",""]
[null,null,"C","X",null,null,null,null,null,null,null,null,null,null,null,null,null,null,null,null,null,"",":","","",":",""]
[null,null,"B","Z",null,null,null,null,null,null,null,null,null,null,null,null,null,null,null,null,null,"",":","","",":",""]
[]
[null,"PAZIN",":",null,"MAESTRAL 2",4,":",0]
[null,null,null,null,"SETOVI",12,":",2]
[null,null,null,null,"POENI",148,":",92]

{"sheet":"BILTEN_1_2","index":35,"n_rows":24,"n_cols":27,"rows_kept":24,"cut":false,"hidden":true,"merged":[[2,23,2,26],[0,0,0,26],[1,1,1,3],[1,4,1,8],[1,9,1,12],[1,13,1,18],[1,19,1,22],[1,23,1,26],[2,1,2,3],[2,4,2,8],[2,9,2,12],[2,13,2,18],[2,19,2,22]]}
["ŽUPANIJSKA LIGA STSIŽ 2025./2026 -  1. kolo — 21.11.2025."]
[null,"GRAD DOMAĆIN",null,null,"DVORANA",null,null,null,null,"KOLO",null,null,null,"DATUM",null,null,null,null,null,"SAT"]
[null,"BUZET",null,null,"SD Buzet",null,null,null,null,"1.",null,null,null,"7. 10. 2025.",null,null,null,null,null,"20:30:00"]
["Domaćin","BUZET 1",null,"Gost","BUZET 2"]
["A","PAULUS Michael",null,"X","DRAŠĆIĆ Petar"]
["B","BERDNYK Stanislav",null,"Y","PAVLETIĆ Guido"]
["C","SIROTIĆ Kevin",null,"Z","KOS Dino",null,null,null,null,null," "]
["R1",null,null,"R1"]
["R2",null,null,"R2"]
[]
[null,"DOMAĆIN",null,null,"GOST"]
[null,"BUZET 1",null,null,"BUZET 2"]
[null,"PAULUS Michael","A","X","DRAŠĆIĆ Petar",11,":",13,7,":",11,5,":",11,null,":",null,null,":",null,null,0,":",3,0,":",1]
[null,"BERDNYK Stanislav","B","Y","PAVLETIĆ Guido",11,":",4,11,":",8,11,":",7,null,":",null,null,":",null,null,3,":",0,1,":",1]
[null,"SIROTIĆ Kevin","C","Z","KOS Dino",11,":",6,13,":",11,11,":",8,null,":",null,null,":",null,null,3,":",0,2,":",1]
[null,"BERDNYK S., PAULUS M.","PAR","PAR","DRAŠĆIĆ P., PAVLETIĆ G.",11,":",4,12,":",10,11,":",5,null,":",null,null,":",null,null,3,":",0,3,":",1]
[null,null,null,null,null,null,null,null,null,null,null,null,null,null,null,null,null,null,null,null,null,"",":","","",":",""]
[null,"PAULUS Michael","A","Y","PAVLETIĆ Guido",10,":",12,11,":",5,11,":",9,11,":",4,null,":",null,null,3,":",1,4,":",1]
[null,null,"C","X",null,null,":",null,null,":",null,null,":",null,null,":",null,null,":",null,null,0,":",0,"",":",""]
[null,null,"B","Z",null,null,":",null,null,":",null,null,":",null,null,":",null,null,":",null,null,0,":",0,"",":",""]
[]
[null,"BUZET 1",":",null,"BUZET 2",4,":",1]
[null,null,null,null,"SETOVI",12,":",4]
[null,null,null,null,"POENI",168,":",128]

{"sheet":"BILTEN_1_3","index":36,"n_rows":24,"n_cols":27,"rows_kept":24,"cut":false,"hidden":true,"merged":[[2,23,2,26],[0,0,0,26],[1,1,1,3],[1,4,1,8],[1,9,1,12],[1,13,1,18],[1,19,1,22],[1,23,1,26],[2,1,2,3],[2,4,2,8],[2,9,2,12],[2,13,2,18],[2,19,2,22]]}
["ŽUPANIJSKA LIGA STSIŽ 2025./2026 -  1. kolo — 21.11.2025."]
[null,"GRAD DOMAĆIN",null,null,"DVORANA",null,null,null,null,"KOLO",null,null,null,"DATUM",null,null,null,null,null,"SAT"]
[null,"PULA",null,null,"Dvorana STK Arena Ferro, Rojc",null,null,null,null,"1.",null,null,null,"15. 10. 2025.",null,null,null,null,null,"17:30:00"]
["Domaćin","ARENA FERRO",null,"Gost","VAL SHARK"]
["A","CINKOPAN Kristijan",null,"X","INFANTOLINO Davide"]
["B","KRANJC Dino",null,"Y","HRVANOVIĆ Jasmin"]
["C","PEKICA Bartol",null,"Z","IVINIĆ Serđo",null,null,null,null,null," "]
["R1",null,null,"R1"]
["R2",null,null,"R2"]
[]
[null,"DOMAĆIN",null,null,"GOST"]
[null,"ARENA FERRO",null,null,"VAL SHARK"]
[null,"CINKOPAN Kristijan","A","X","INFANTOLINO Davide",9,":",11,11,":",4,1,":",11,20,":",18,11,":",9,null,3,":",2,1,":",0]
[null,"KRANJC Dino","B","Y","HRVANOVIĆ Jasmin",11,":",6,11,":",9,11,":",3,null,":",null,null,":",null,null,3,":",0,2,":",0]
[null,"PEKICA Bartol","C","Z","IVINIĆ Serđo",11,":",9,5,":",11,11,":",6,11,":",8,null,":",null,null,3,":",1,3,":",0]
[null,"CINKOPAN K., PEKICA B.","PAR","PAR","HRVANOVIĆ J., IVINIĆ S.",11,":",9,6,":",11,11,":",7,11,":",4,null,":",null,null,3,":",1,4,":",0]
[null,null,null,null,null,null,null,null,null,null,null,null,null,null,null,null,null,null,null,null,null,"",":","","",":",""]
[null,null,"A","Y",null,null,":",null,null,":",null,null,":",null,null,":",null,null,":",null,null,0,":",0,"",":",""]
[null,null,"C","X",null,null,":",null,null,":",null,null,":",null,null,":",null,null,":",null,null,0,":",0,"",":",""]
[null,null,"B","Z",null,null,":",null,null,":",null,null,":",null,null,":",null,null,":",null,null,0,":",0,"",":",""]
[]
[null,"ARENA FERRO",":",null,"VAL SHARK",4,":",0]
[null,null,null,null,"SETOVI",12,":",4]
[null,null,null,null,"POENI",162,":",136]

{"sheet":"BILTEN_1_POREDAK","index":37,"n_rows":8,"n_cols":14,"rows_kept":8,"cut":false,"hidden":true,"merged":[[1,3,1,4],[1,5,1,6],[1,7,1,8],[1,9,1,10],[0,0,0,13]]}
["DRUGA HSTL - PIG REGIJA - 1. kolo — 21.11.2025."]
["RANG","KLUB","ODIGRANO","SKOR",null,"MEČ RAZLIKA",null,"SET RAZLIKA",null,"POEN RAZLIKA",null,"BOD",7]
[1,"PAZIN",5,4,1,17,9,57,41,882,805,9,0,0]
[2,"ARENA FERRO",5,3,2,17,9,63,36,966,850,8,0,0]
[3,"VAL SHARK",3,2,1,8,6,30,26,529,501,5,0,0]
[4,"BUZET 1",3,1,2,6,9,22,31,462,503,4,0,0]
[5,"BROVINJE 2",2,1,1,5,6,20,23,401,404,3,0,0]
[6,"BUZET 2",3,0,3,2,12,11,36,357,478,3,0,0]

{"sheet":"BILTEN_2_1","index":38,"n_rows":24,"n_cols":27,"rows_kept":24,"cut":false,"hidden":true,"merged":[[2,23,2,26],[0,0,0,26],[1,1,1,3],[1,4,1,8],[1,9,1,12],[1,13,1,18],[1,19,1,22],[1,23,1,26],[2,1,2,3],[2,4,2,8],[2,9,2,12],[2,13,2,18],[2,19,2,22]]}
["ŽUPANIJSKA LIGA STSIŽ 2025./2026 -  2. kolo — 21.11.2025."]
[null,"GRAD DOMAĆIN",null,null,"DVORANA",null,null,null,null,"KOLO",null,null,null,"DATUM",null,null,null,null,null,"SAT"]
[null,"KOROMAČNO",null,null,"Društveni dom Koromačno",null,null,null,null,"2.",null,null,null,"7. 10. 2025.",null,null,null,null,null,"18:00:00"]
["Domaćin","BROVINJE 2",null,"Gost","VAL SHARK"]
["A","BENAZIĆ Sandro",null,"X","HRVANOVIĆ Jasmin"]
["B","STIPIĆ Matea",null,"Y","INFANTOLINO Davide"]
["C","BASIACO Leonida",null,"Z","IVINIĆ Serđo",null,null,null,null,null," "]
["R1",null,null,"R1"]
["R2",null,null,"R2"]
[]
[null,"DOMAĆIN",null,null,"GOST"]
[null,"BROVINJE 2",null,null,"VAL SHARK"]
[null,"BENAZIĆ Sandro","A","X","HRVANOVIĆ Jasmin",6,":",11,11,":",9,8,":",11,9,":",11,null,":",null,null,1,":",3,0,":",1]
[null,"STIPIĆ Matea","B","Y","INFANTOLINO Davide",8,":",11,2,":",11,7,":",11,null,":",null,null,":",null,null,0,":",3,0,":",2]
[null,"BASIACO Leonida","C","Z","IVINIĆ Serđo",11,":",9,11,":",5,11,":",5,null,":",null,null,":",null,null,3,":",0,1,":",2]
[null,"BENAZIĆ S., BASIACO L.","PAR","PAR","HRVANOVIĆ J., IVINIĆ S.",11,":",6,8,":",11,9,":",11,11,":",9,7,":",11,null,2,":",3,1,":",3]
[null,null,null,null,null,null,":",null,null,":",null,null,":",null,null,":",null,null,":",null,null,0,":",0,"",":",""]
[null,"BENAZIĆ Sandro","A","Y","INFANTOLINO Davide",11,":",9,12,":",14,7,":",11,9,":",11,null,":",null,null,1,":",3,1,":",4]
[null,null,"C","X",null,null,":",null,null,":",null,null,":",null,null,":",null,null,":",null,null,0,":",0,"",":",""]
[null,null,"B","Z",null,null,":",null,null,":",null,null,":",null,null,":",null,null,":",null,null,0,":",0,"",":",""]
[]
[null,"BROVINJE 2",":",null,"VAL SHARK",1,":",4]
[null,null,null,null,"SETOVI",7,":",12]
[null,null,null,null,"POENI",169,":",187]

{"sheet":"BILTEN_2_2","index":39,"n_rows":24,"n_cols":27,"rows_kept":24,"cut":false,"hidden":true,"merged":[[2,23,2,26],[0,0,0,26],[1,1,1,3],[1,4,1,8],[1,9,1,12],[1,13,1,18],[1,19,1,22],[1,23,1,26],[2,1,2,3],[2,4,2,8],[2,9,2,12],[2,13,2,18],[2,19,2,22]]}
["ŽUPANIJSKA LIGA STSIŽ 2025./2026 -  2. kolo — 21.11.2025."]
[null,"GRAD DOMAĆIN",null,null,"DVORANA",null,null,null,null,"KOLO",null,null,null,"DATUM",null,null,null,null,null,"SAT"]
[null,"KOROMAČNO",null,null,"Društveni dom Koromačno",null,null,null,null,"2.",null,null,null,"7. 10. 2025.",null,null,null,null,null,"18:00:00"]
["Domaćin","BROVINJE 2",null,"Gost","ARENA FERRO"]
["A","BASIACO Leonida",null,"X","KRIŠTO Tomislav"]
["B","BENAZIĆ Sandro",null,"Y","CINKOPAN Kristijan"]
["C","GASPARI HUDOLETNJAK Matija",null,"Z","KELEMEN Mićo",null,null,null,null,null," "]
["R1",null,null,"R1"]
["R2",null,null,"R2"]
[]
[null,"DOMAĆIN",null,null,"GOST"]
[null,"BROVINJE 2",null,null,"ARENA FERRO"]
[null,"BASIACO Leonida","A","X","KRIŠTO Tomislav",11,":",5,11,":",5,11,":",9,null,":",null,null,":",null,null,3,":",0,1,":",0]
[null,"BENAZIĆ Sandro","B","Y","CINKOPAN Kristijan",10,":",12,12,":",14,7,":",11,null,":",null,null,":",null,null,0,":",3,1,":",1]
[null,"GASPARI HUDOLETNJAK Matija","C","Z","KELEMEN Mićo",10,":",12,11,":",2,11,":",8,11,":",8,null,":",null,null,3,":",1,2,":",1]
[null,"BASIACO L., GASPARI HUDOLETNJAK","PAR","PAR","CINKOPAN K., KELEMEN M.",7,":",11,11,":",8,8,":",11,7,":",11,null,":",null,null,1,":",3,2,":",2]
[null,null,null,null,null,null,":",null,null,":",null,null,":",null,null,":",null,null,":",null,null,0,":",0,"",":",""]
[null,"BASIACO Leonida","A","Y","CINKOPAN Kristijan",11,":",8,11,":",8,9,":",11,7,":",11,11,":",7,null,3,":",2,3,":",2]
[null,"GASPARI HUDOLETNJAK Matija","C","X","KRIŠTO Tomislav",11,":",8,11,":",8,6,":",11,6,":",11,11,":",7,null,3,":",2,4,":",2]
[null,null,"B","Z",null,null,":",null,null,":",null,null,":",null,null,":",null,null,":",null,null,0,":",0,"",":",""]
[]
[null,"BROVINJE 2",":",null,"ARENA FERRO",4,":",2]
[null,null,null,null,"SETOVI",13,":",11]
[null,null,null,null,"POENI",232,":",217]

{"sheet":"BILTEN_2_3","index":40,"n_rows":24,"n_cols":27,"rows_kept":24,"cut":false,"hidden":true,"merged":[[2,23,2,26],[0,0,0,26],[1,1,1,3],[1,4,1,8],[1,9,1,12],[1,13,1,18],[1,19,1,22],[1,23,1,26],[2,1,2,3],[2,4,2,8],[2,9,2,12],[2,13,2,18],[2,19,2,22]]}
["ŽUPANIJSKA LIGA STSIŽ 2025./2026 -  2. kolo — 21.11.2025."]
[null,"GRAD DOMAĆIN",null,null,"DVORANA",null,null,null,null,"KOLO",null,null,null,"DATUM",null,null,null,null,null,"SAT"]
[null,"PAZIN",null,null,"Sportska dvorana Pazin",null,null,null,null,"2.",null,null,null,"25. 10. 2025.",null,null,null,null,null,"10:30:00"]
["Domaćin","PAZIN",null,"Gost","BUZET 2"]
["A","FABIJAN Damir",null,"X","DRAŠĆIĆ Petar"]
["B","FABRIS Karlo",null,"Y","PAVLETIĆ Guido"]
["C","GLAVINIĆ Denis",null,"Z","BOŠNJAKOVIĆ Dubravko",null,null,null,null,null," "]
["R1",null,null,"R1"]
["R2",null,null,"R2"]
[]
[null,"DOMAĆIN",null,null,"GOST"]
[null,"PAZIN",null,null,"BUZET 2"]
[null,"FABIJAN Damir","A","X","DRAŠĆIĆ Petar",3,":",11,4,":",11,7,":",11,null,":",null,null,":",null,null,0,":",3,0,":",1]
[null,"FABRIS Karlo","B","Y","PAVLETIĆ Guido",11,":",1,11,":",6,11,":",6,null,":",null,null,":",null,null,3,":",0,1,":",1]
[null,"GLAVINIĆ Denis","C","Z","BOŠNJAKOVIĆ Dubravko",11,":",3,11,":",4,11,":",4,null,":",null,null,":",null,null,3,":",0,2,":",1]
[null,"GLAVINIĆ D., LUKEZ G.","PAR","PAR","DRAŠĆIĆ P., PAVLETIĆ G.",11,":",8,11,":",7,11,":",5,null,":",null,null,":",null,null,3,":",0,3,":",1]
[null,null,null,null,null,null,":",null,null,":",null,null,":",null,null,":",null,null,":",null,null,0,":",0,"",":",""]
[null,"FABIJAN Damir","A","Y","PAVLETIĆ Guido",9,":",11,6,":",11,12,":",10,11,":",5,11,":",9,null,3,":",2,4,":",1]
[null,null,"C","X",null,null,":",null,null,":",null,null,":",null,null,":",null,null,":",null,null,0,":",0,"",":",""]
[null,null,"B","Z",null,null,":",null,null,":",null,null,":",null,null,":",null,null,":",null,null,0,":",0,"",":",""]
[]
[null,"PAZIN",":",null,"BUZET 2",4,":",1]
[null,null,null,null,"SETOVI",12,":",5]
[null,null,null,null,"POENI",162,":",123]

{"sheet":"BILTEN_2_4","index":41,"n_rows":24,"n_cols":27,"rows_kept":24,"cut":false,"hidden":true,"merged":[[2,23,2,26],[0,0,0,26],[1,1,1,3],[1,4,1,8],[1,9,1,12],[1,13,1,18],[1,19,1,22],[1,23,1,26],[2,1,2,3],[2,4,2,8],[2,9,2,12],[2,13,2,18],[2,19,2,22]]}
["ŽUPANIJSKA LIGA STSIŽ 2025./2026 -  2. kolo — 21.11.2025."]
[null,"GRAD DOMAĆIN",null,null,"DVORANA",null,null,null,null,"KOLO",null,null,null,"DATUM",null,null,null,null,null,"SAT"]
[null,"PAZIN",null,null,"Sportska dvorana Pazin",null,null,null,null,"2.",null,null,null,"25. 10. 2025.",null,null,null,null,null,"12:00:00"]
["Domaćin","PAZIN",null,"Gost","BUZET 1"]
["A","GLAVINIĆ Denis",null,"X","SIROTIĆ Aleš"]
["B","LUKEZ Goran",null,"Y","KRANČIĆ Filip"]
["C","FABRIS Karlo",null,"Z","BERDNYK Stanislav",null,null,null,null,null," "]
["R1",null,null,"R1"]
["R2",null,null,"R2"]
[]
[null,"DOMAĆIN",null,null,"GOST"]
[null,"PAZIN",null,null,"BUZET 1"]
[null,"GLAVINIĆ Denis","A","X","SIROTIĆ Aleš",11,":",1,11,":",1,11,":",9,null,":",null,null,":",null,null,3,":",0,1,":",0]
[null,"LUKEZ Goran","B","Y","KRANČIĆ Filip",11,":",6,11,":",6,3,":",11,6,":",11,12,":",10,null,3,":",2,2,":",0]
[null,"FABRIS Karlo","C","Z","BERDNYK Stanislav",11,":",8,11,":",6,11,":",6,null,":",null,null,":",null,null,3,":",0,3,":",0]
[null,"GLAVINIĆ D., LUKEZ G.","PAR","PAR","SIROTIĆ A., KRANČIĆ F.",11,":",6,7,":",11,12,":",14,2,":",11,null,":",null,null,1,":",3,3,":",1]
[null,null,null,null,null,null,":",null,null,":",null,null,":",null,null,":",null,null,":",null,null,0,":",0,"",":",""]
[null,"GLAVINIĆ Denis","A","Y","KRANČIĆ Filip",11,":",1,11,":",6,3,":",11,11,":",8,null,":",null,null,3,":",1,4,":",1]
[null,null,"C","X",null,null,":",null,null,":",null,null,":",null,null,":",null,null,":",null,null,0,":",0,"",":",""]
[null,null,"B","Z",null,null,":",null,null,":",null,null,":",null,null,":",null,null,":",null,null,0,":",0,"",":",""]
[]
[null,"PAZIN",":",null,"BUZET 1",4,":",1]
[null,null,null,null,"SETOVI",13,":",6]
[null,null,null,null,"POENI",177,":",143]

{"sheet":"BILTEN_2_POREDAK","index":42,"n_rows":8,"n_cols":14,"rows_kept":8,"cut":false,"hidden":true,"merged":[[1,3,1,4],[1,5,1,6],[1,7,1,8],[1,9,1,10],[0,0,0,13]]}
["ŽUPANIJSKA LIGA STSIŽ - 2. kolo — 21.11.2025."]
["RANG","KLUB","ODIGRANO","SKOR",null,"MEČ RAZLIKA",null,"SET RAZLIKA",null,"POEN RAZLIKA",null,"BOD",7]
[1,"PAZIN",5,4,1,17,9,57,41,882,805,9,0,0]
[2,"ARENA FERRO",5,3,2,17,9,63,36,966,850,8,0,0]
[3,"VAL SHARK",3,2,1,8,6,30,26,529,501,5,0,0]
[4,"BUZET 1",3,1,2,6,9,22,31,462,503,4,0,0]
[5,"BROVINJE 2",2,1,1,5,6,20,23,401,404,3,0,0]
[6,"BUZET 2",3,0,3,2,12,11,36,357,478,3,0,0]

{"sheet":"WEB_DATA","index":43,"n_rows":43,"n_cols":7,"rows_kept":43,"cut":false,"hidden":true,"merged":[]}
["team","match_no","wl","points","cum_points","score","k_index"]
["PAZIN",1,"W",2,2,"04:00:00",2]
["PAZIN",2,"W",2,4,"04:01:00",7]
["PAZIN",3,"W",2,6,"04:01:00",8]
["PAZIN",4,"L",1,7,"01:04:00",9]
["PAZIN",5,"W",2,9,"04:03:00",10]
["PAZIN",6,"W",2,11,"04:03:00",17]
["ARENA FERRO",1,"W",2,2,"04:00:00",4]
["ARENA FERRO",2,"L",1,3,"02:04:00",6]
["ARENA FERRO",3,"L",1,4,"03:04:00",10]
["ARENA FERRO",4,"W",2,6,"04:01:00",13]
["ARENA FERRO",5,"W",2,8,"04:00:00",14]
["ARENA FERRO",6,"W",2,10,"04:02:00",22]
["BROVINJE 2",1,"L",1,1,"01:04:00",5]
["BROVINJE 2",2,"W",2,3,"04:02:00",6]
["BROVINJE 2",3,"L",1,4,"03:04:00",17]
["BROVINJE 2",4,"W",2,6,"04:01:00",18]
["BROVINJE 2",5,"W",2,8,"04:03:00",19]
["BROVINJE 2",6,"W",2,10,"04:00:00",20]
["VAL SHARK",1,"L",1,1,"00:04:00",4]
["VAL SHARK",2,"W",2,3,"04:01:00",5]
["VAL SHARK",3,"W",2,5,"04:01:00",9]
["VAL SHARK",4,"W",2,7,"04:01:00",15]
["VAL SHARK",5,"W",2,9,"04:00:00",16]
["VAL SHARK",6,"L",1,10,"02:04:00",21]
["BUZET 1",1,"W",2,2,"04:01:00",3]
["BUZET 1",2,"L",1,3,"01:04:00",8]
["BUZET 1",3,"W",2,5,"04:00:00",12]
["BUZET 1",4,"L",1,6,"01:04:00",13]
["BUZET 1",5,"L",1,7,"00:04:00",16]
["BUZET 1",6,"L",1,8,"03:04:00",19]
["BUZET 2",1,"L",1,1,"01:04:00",3]
["BUZET 2",2,"L",1,2,"01:04:00",7]
["BUZET 2",3,"W",2,4,"04:00:00",11]
["BUZET 2",4,"L",1,5,"00:04:00",14]
["BUZET 2",5,"L",1,6,"01:04:00",15]
["BUZET 2",6,"L",1,7,"00:04:00",20]
["MAESTRAL 2",1,"L",1,1,"00:04:00",2]
["MAESTRAL 2",2,"L",1,2,"00:04:00",11]
["MAESTRAL 2",3,"L",1,3,"00:04:00",12]
["MAESTRAL 2",4,"L",1,4,"01:04:00",18]
["MAESTRAL 2",5,"W",2,6,"04:02:00",21]
["MAESTRAL 2",6,"L",1,7,"02:04:00",22]

{"sheet":"WEB_JSON","index":44,"n_rows":3,"n_cols":2,"rows_kept":3,"cut":false,"hidden":true,"merged":[]}
["Kopiraj sadržaj A3 u datoteku web-data.json i upload na hosting."]
["Generirano:","2026-01-03T14:42:26.752Z"]
["[{\"team\":\"PAZIN\",\"match_no\":1,\"wl\":\"W\",\"points\":2,\"cum_points\":2,\"score\":\"4:0\"},{\"team\":\"PAZIN\",\"match_no\":2,\"wl\":\"W\",\"points\":2,\"cum_points\":4,\"score\":\"4:1\"},{\"team\":\"PAZIN\",\"match_no\":3,\"wl\":\"W\",\"points\":2,\"cum_points\":6,\"score\":\"4:1\"},{\"team\":\"PAZIN\",\"match_no\":4,\"wl\":\"L\",\"points\":1,\"cum_points\":7,\"score\":\"1:4\"},{\"team\":\"PAZIN\",\"match_no\":5,\"wl\":\"W\",\"points\":2,\"cum_points\":9,\"score\":\"4:3\"},{\"team\":\"PAZIN\",\"match_no\":6,\"wl\":\"W\",\"points\":2,\"cum_points\":11,\"score\":\"4:3\"},{\"team\":\"ARENA FERRO\",\"match_no\":1,\"wl\":\"W\",\"points\":2,\"cum_points\":2,\"score\":\"4:0\"},{\"team\":\"ARENA FERRO\",\"match_no\":2,\"wl\":\"L\",\"points\":1,\"cum_points\":3,\"score\":\"2:4\"},{\"team\":\"ARENA FERRO\",\"match_no\":3,\"wl\":\"L\",\"points\":1,\"cum_points\":4,\"score\":\"3:4\"},{\"team\":\"ARENA FERRO\",\"match_no\":4,\"wl\":\"W\",\"points\":2,\"cum_points\":6,\"score\":\"4:1\"},{\"team\":\"ARENA FERRO\",\"match_no\":5,\"wl\":\"W\",\"points\":2,\"cum_points\":8,\"score\":\"4:0\"},{\"team\":\"ARENA FERRO\",\"match_no\":6,\"wl\":\"W\",\"points\":2,\"cum_points\":10,\"score\":\"4:2\"},{\"team\":\"BROVINJE 2\",\"match_no\":1,\"wl\":\"L\",\"points\":1,\"cum_points\":1,\"score\":\"1:4\"},{\"team\":\"BROVINJE 2\",\"match_no\":2,\"wl\":\"W\",\"points\":2,\"cum_points\":3,\"score\":\"4:2\"},{\"team\":\"BROVINJE 2\",\"match_no\":3,\"wl\":\"L\",\"points\":1,\"cum_points\":4,\"score\":\"3:4\"},{\"team\":\"BROVINJE 2\",\"match_no\":4,\"wl\":\"W\",\"points\":2,\"cum_points\":6,\"score\":\"4:1\"},{\"team\":\"BROVINJE 2\",\"match_no\":5,\"wl\":\"W\",\"points\":2,\"cum_points\":8,\"score\":\"4:3\"},{\"team\":\"BROVINJE 2\",\"match_no\":6,\"wl\":\"W\",\"points\":2,\"cum_points\":10,\"score\":\"4:0\"},{\"team\":\"VAL SHARK\",\"match_no\":1,\"wl\":\"L\",\"points\":1,\"cum_points\":1,\"score\":\"0:4\"},{\"team\":\"VAL SHARK\",\"match_no\":2,\"wl\":\"W\",\"points\":2,\"cum_points\":3,\"score\":\"4:1\"},{\"team\":\"VAL SHARK\",\"match_no\":3,\"wl\":\"W\",\"points\":2,\"cum_points\":5,\"score\":\"4:1\"},{\"team\":\"VAL SHARK\",\"match_no\":4,\"wl\":\"W\",\"points\":2,\"cum_points\":7,\"score\":\"4:1\"},{\"team\":\"VAL SHARK\",\"match_no\":5,\"wl\":\"W\",\"points\":2,\"cum_points\":9,\"score\":\"4:0\"},{\"team\":\"VAL SHARK\",\"match_no\":6,\"wl\":\"L\",\"points\":1,\"cum_points\":10,\"score\":\"2:4\"},{\"team\":\"BUZET 1\",\"match_no\":1,\"wl\":\"W\",\"points\":2,\"cum_points\":2,\"score\":\"4:1\"},{\"team\":\"BUZET 1\",\"match_no\":2,\"wl\":\"L\",\"points\":1,\"cum_points\":3,\"score\":\"1:4\"},{\"team\":\"BUZET 1\",\"match_no\":3,\"wl\":\"W\",\"points\":2,\"cum_points\":5,\"score\":\"4:0\"},{\"team\":\"BUZET 1\",\"match_no\":4,\"wl\":\"L\",\"points\":1,\"cum_points\":6,\"score\":\"1:4\"},{\"team\":\"BUZET 1\",\"match_no\":5,\"wl\":\"L\",\"points\":1,\"cum_points\":7,\"score\":\"0:4\"},{\"team\":\"BUZET 1\",\"match_no\":6,\"wl\":\"L\",\"points\":1,\"cum_points\":8,\"score\":\"3:4\"},{\"team\":\"BUZET 2\",\"match_no\":1,\"wl\":\"L\",\"points\":1,\"cum_points\":1,\"score\":\"1:4\"},{\"team\":\"BUZET 2\",\"match_no\":2,\"wl\":\"L\",\"points\":1,\"cum_points\":2,\"score\":\"1:4\"},{\"team\":\"BUZET 2\",\"match_no\":3,\"wl\":\"W\",\"points\":2,\"cum_points\":4,\"score\":\"4:0\"},{\"team\":\"BUZET 2\",\"match_no\":4,\"wl\":\"L\",\"points\":1,\"cum_points\":5,\"score\":\"0:4\"},{\"team\":\"BUZET 2\",\"match_no\":5,\"wl\":\"L\",\"points\":1,\"cum_points\":6,\"score\":\"1:4\"},{\"team\":\"BUZET 2\",\"match_no\":6,\"wl\":\"L\",\"points\":1,\"cum_points\":7,\"score\":\"0:4\"},{\"team\":\"MAESTRAL 2\",\"match_no\":1,\"wl\":\"L\",\"points\":1,\"cum_points\":1,\"score\":\"0:4\"},{\"team\":\"MAESTRAL 2\",\"match_no\":2,\"wl\":\"L\",\"points\":1,\"cum_points\":2,\"score\":\"0:4\"},{\"team\":\"MAESTRAL 2\",\"match_no\":3,\"wl\":\"L\",\"points\":1,\"cum_points\":3,\"score\":\"0:4\"},{\"team\":\"MAESTRAL 2\",\"match_no\":4,\"wl\":\"L\",\"points\":1,\"cum_points\":4,\"score\":\"1:4\"},{\"team\":\"MAESTRAL 2\",\"match_no\":5,\"wl\":\"W\",\"points\":2,\"cum_points\":6,\"score\":\"4:2\"},{\"team\":\"MAESTRAL 2\",\"match_no\":6,\"wl\":\"L\",\"points\":1,\"cum_points\":7,\"score\":\"2:4\"}]"]